null
SMILES: CC(C)C[C@H](NC(=O)CN=[N+]=[N-])C(=O)N[C@@H](CC(C)C)C(=O)NCC#N
InChI Key: InChIKey=LFKAXBWLDYOUJZ-STQMWFEESA-N
Activity Spreadsheet -- Enzyme Inhibition Constant Data from BindingDB
Found 1 hit for monomerid = 50048068
Trg + Lig
Ki
nM
ΔG°
kcal/mole
IC50
nM
Kd
nM
EC50/IC50
nM
koff
s-1
kon
M-1s-1
pHTemp
°C
Papain
(Carica papaya)
BDBM50048068
(CHEMBL3357961)
Show SMILES CC(C)C[C@H](NC(=O)CN=[N+]=[N-])C(=O)N[C@@H](CC(C)C)C(=O)NCC#N |r|
Show InChI InChI=1S/C16H27N7O3/c1-10(2)7-12(15(25)19-6-5-17)22-16(26)13(8-11(3)4)21-14(24)9-20-23-18/h10-13H,6-9H2,1-4H3,(H,19,25)(H,21,24)(H,22,26)/t12-,13-/m0/s1
n/an/a 2.71E+3n/an/an/an/an/an/a
Radboud University Nijmegen
Curated by ChEMBL
Assay Description
Inhibition of papaya papain using Z-Phe-Arg-pNA substrate by spectrophotometry
Bioorg Med Chem 22: 5593-603 (2014)
Article DOI: 10.1016/j.bmc.2014.06.001
BindingDB Entry DOI: 10.7270/Q22N53X1