BDBM50048195 CHEMBL144100::N-[1-Oxo-6-(thiophen-2-ylsulfanyl)-indan-5-yl]-methanesulfonamide
SMILES: CS(=O)(=O)Nc1cc2CCC(=O)c2cc1Sc1cccs1
InChI Key: InChIKey=MNEGJUFMXCJITI-UHFFFAOYSA-N
Data: 1 IC50
Activity Spreadsheet -- Enzyme Inhibition Constant Data from BindingDB
Found 1 hit for monomerid = 50048195
Trg + Lig
Ki
nM
ΔG°
kcal/mole
IC50
nM
Kd
nM
EC50/IC50
nM
koff
s-1
kon
M-1s-1
pHTemp
°C
Cyclooxygenase
(Homo sapiens (Human))
BDBM50048195
(CHEMBL144100 | N-[1-Oxo-6-(thiophen-2-ylsulfanyl)-...)
Show SMILES CS(=O)(=O)Nc1cc2CCC(=O)c2cc1Sc1cccs1
Show InChI InChI=1S/C14H13NO3S3/c1-21(17,18)15-11-7-9-4-5-12(16)10(9)8-13(11)20-14-3-2-6-19-14/h2-3,6-8,15H,4-5H2,1H3
NCI pathway
Reactome pathway
n/an/a 1.00E+3n/an/an/an/an/an/a
Merck Frosst Centre for Therapeutic Research
Curated by ChEMBL
Assay Description
In vitro inhibition of prostaglandin G/H synthase 2 expressed in human osteosarcoma 143 cells
J Med Chem 38: 4897-905 (1996)
BindingDB Entry DOI: 10.7270/Q28051PC