BDBM50048213 CHEMBL356804::N-[6-(2-Methoxy-phenylsulfanyl)-1-oxo-indan-5-yl]-methanesulfonamide
SMILES: COc1ccccc1Sc1cc2C(=O)CCc2cc1NS(C)(=O)=O
InChI Key: InChIKey=RLRNWCQXTMORPF-UHFFFAOYSA-N
Data: 1 IC50
Activity Spreadsheet -- Enzyme Inhibition Constant Data from BindingDB
Found 1 hit for monomerid = 50048213
Trg + Lig
Ki
nM
ΔG°
kcal/mole
IC50
nM
Kd
nM
EC50/IC50
nM
koff
s-1
kon
M-1s-1
pHTemp
°C
Cyclooxygenase
(Homo sapiens (Human))
BDBM50048213
(CHEMBL356804 | N-[6-(2-Methoxy-phenylsulfanyl)-1-o...)
Show SMILES COc1ccccc1Sc1cc2C(=O)CCc2cc1NS(C)(=O)=O
Show InChI InChI=1S/C17H17NO4S2/c1-22-15-5-3-4-6-16(15)23-17-10-12-11(7-8-14(12)19)9-13(17)18-24(2,20)21/h3-6,9-10,18H,7-8H2,1-2H3
NCI pathway
Reactome pathway
n/an/a>1.00E+4n/an/an/an/an/an/a
Merck Frosst Centre for Therapeutic Research
Curated by ChEMBL
Assay Description
In vitro inhibition of prostaglandin G/H synthase 2 expressed in human osteosarcoma 143 cells
J Med Chem 38: 4897-905 (1996)
BindingDB Entry DOI: 10.7270/Q28051PC