BDBM50048224 CHEMBL3310794
SMILES: Oc1cc(nc(SCc2cccc(F)c2F)n1)C1CC1
InChI Key: InChIKey=GDQKGVCSBBIFKK-UHFFFAOYSA-N
Data: 1 IC50
Activity Spreadsheet -- Enzyme Inhibition Constant Data from BindingDB
Found 1 hit for monomerid = 50048224
Trg + Lig
Ki
nM
ΔG°
kcal/mole
IC50
nM
Kd
nM
EC50/IC50
nM
koff
s-1
kon
M-1s-1
pHTemp
°C
C-X-C chemokine receptor type 2
(Homo sapiens (Human))
BDBM50048224
(CHEMBL3310794)
Show SMILES Oc1cc(nc(SCc2cccc(F)c2F)n1)C1CC1
Show InChI InChI=1S/C14H12F2N2OS/c15-10-3-1-2-9(13(10)16)7-20-14-17-11(8-4-5-8)6-12(19)18-14/h1-3,6,8H,4-5,7H2,(H,17,18,19)
Reactome pathway
n/an/a 320n/an/an/an/an/an/a
Novartis Institutes for BioMedical Research
Curated by ChEMBL
Assay Description
Antagonist activity against human recombinant CXCR2 receptor expressed in CHO cell membranes by SPA based [35S]GTPgammaS binding assay
Bioorg Med Chem Lett 24: 3285-90 (2014)
Article DOI: 10.1016/j.bmcl.2014.06.011
BindingDB Entry DOI: 10.7270/Q2930VTJ