BDBM50048248 (3S,4R)-3-Acetyl-4-(3-cyclopentyloxy-4-methoxy-phenyl)-pyrrolidine-1-carboxylic acid methyl ester::CHEMBL59003::methyl 3-acetyl-4-(3-cyclopentyloxy-4-methoxyphenyl)-(3S,4R)-tetrahydro-1H-1-pyrrolecarboxylate
SMILES: COC(=O)N1C[C@H]([C@@H](C1)c1ccc(OC)c(OC2CCCC2)c1)C(C)=O
InChI Key: InChIKey=XRUNGFIMYAZVGB-IRXDYDNUSA-N
Data: 1 KI  1 IC50
Activity Spreadsheet -- Enzyme Inhibition Constant Data from BindingDB
Found 2 hits for monomerid = 50048248
Trg + Lig
Ki
nM
ΔG°
kcal/mole
IC50
nM
Kd
nM
EC50/IC50
nM
koff
s-1
kon
M-1s-1
pHTemp
°C
cAMP-specific 3',5'-cyclic phosphodiesterase 4B
(Homo sapiens (Human))
BDBM50048248
((3S,4R)-3-Acetyl-4-(3-cyclopentyloxy-4-methoxy-phe...)
Show SMILES COC(=O)N1C[C@H]([C@@H](C1)c1ccc(OC)c(OC2CCCC2)c1)C(C)=O
Show InChI InChI=1S/C20H27NO5/c1-13(22)16-11-21(20(23)25-3)12-17(16)14-8-9-18(24-2)19(10-14)26-15-6-4-5-7-15/h8-10,15-17H,4-7,11-12H2,1-3H3/t16-,17-/m0/s1
30n/an/an/an/an/an/an/an/a
TBA
Curated by ChEMBL
Assay Description
Ability to inhibit the catalytic activity of human Phosphodiesterase 4B (PDE IVB)
Bioorg Med Chem Lett 5: 1977-1982 (1995)
Article DOI: 10.1016/0960-894X(95)00336-R
BindingDB Entry DOI: 10.7270/Q2PN95MX
cAMP-specific 3',5'-cyclic phosphodiesterase 4B
(Homo sapiens (Human))
BDBM50048248
((3S,4R)-3-Acetyl-4-(3-cyclopentyloxy-4-methoxy-phe...)
Show SMILES COC(=O)N1C[C@H]([C@@H](C1)c1ccc(OC)c(OC2CCCC2)c1)C(C)=O
Show InChI InChI=1S/C20H27NO5/c1-13(22)16-11-21(20(23)25-3)12-17(16)14-8-9-18(24-2)19(10-14)26-15-6-4-5-7-15/h8-10,15-17H,4-7,11-12H2,1-3H3/t16-,17-/m0/s1
n/an/a 320n/an/an/an/an/an/a
TBA
Curated by ChEMBL
Assay Description
Inhibition of rolipram binding to Phosphodiesterase 4B
Bioorg Med Chem Lett 5: 1977-1982 (1995)
Article DOI: 10.1016/0960-894X(95)00336-R
BindingDB Entry DOI: 10.7270/Q2PN95MX