BDBM50048251 CHEMBL3310779
SMILES: Cc1nc(SCc2cccc(F)c2F)nc(O)c1C#N
InChI Key: InChIKey=VTXCMBMATZHHSJ-UHFFFAOYSA-N
Data: 1 IC50
Activity Spreadsheet -- Enzyme Inhibition Constant Data from BindingDB
Found 1 hit for monomerid = 50048251
Trg + Lig
Ki
nM
ΔG°
kcal/mole
IC50
nM
Kd
nM
EC50/IC50
nM
koff
s-1
kon
M-1s-1
pHTemp
°C
C-X-C chemokine receptor type 2
(Homo sapiens (Human))
BDBM50048251
(CHEMBL3310779)
Show SMILES Cc1nc(SCc2cccc(F)c2F)nc(O)c1C#N
Show InChI InChI=1S/C13H9F2N3OS/c1-7-9(5-16)12(19)18-13(17-7)20-6-8-3-2-4-10(14)11(8)15/h2-4H,6H2,1H3,(H,17,18,19)
Reactome pathway
n/an/a 4.30E+3n/an/an/an/an/an/a
Novartis Institutes for BioMedical Research
Curated by ChEMBL
Assay Description
Antagonist activity against human recombinant CXCR2 receptor expressed in CHO cell membranes by SPA based [35S]GTPgammaS binding assay
Bioorg Med Chem Lett 24: 3285-90 (2014)
Article DOI: 10.1016/j.bmcl.2014.06.011
BindingDB Entry DOI: 10.7270/Q2930VTJ