BDBM50048347 CHEMBL3315069
SMILES: CC(C)(O)c1ccc(cn1)-c1ccc2[C@H](c3cccc(F)c3Oc2n1)C(C)(C)C(=O)NC(N)=O
InChI Key: InChIKey=VKVZOFDGLCTSKW-IBGZPJMESA-N
Data: 2 KI  4 EC50
Activity Spreadsheet -- Enzyme Inhibition Constant Data from BindingDB
Found 6 hits for monomerid = 50048347
Trg + Lig
Ki
nM
ΔG°
kcal/mole
IC50
nM
Kd
nM
EC50/IC50
nM
koff
s-1
kon
M-1s-1
pHTemp
°C
Glucocorticoid receptor
(Homo sapiens (Human))
BDBM50048347
(CHEMBL3315069)
Show SMILES CC(C)(O)c1ccc(cn1)-c1ccc2[C@H](c3cccc(F)c3Oc2n1)C(C)(C)C(=O)NC(N)=O |r|
Show InChI InChI=1S/C25H25FN4O4/c1-24(2,22(31)30-23(27)32)19-14-6-5-7-16(26)20(14)34-21-15(19)9-10-17(29-21)13-8-11-18(28-12-13)25(3,4)33/h5-12,19,33H,1-4H3,(H3,27,30,31,32)/t19-/m0/s1
4n/an/an/an/an/an/an/an/a
Bristol-Myers Squibb Company
Curated by ChEMBL
Assay Description
Binding affinity to glucocorticoid receptor (unknown origin) by fluorescence polarization assay
Bioorg Med Chem Lett 24: 3268-73 (2014)
Article DOI: 10.1016/j.bmcl.2014.06.010
BindingDB Entry DOI: 10.7270/Q21N82SN
Progesterone receptor
(Homo sapiens (Human))
BDBM50048347
(CHEMBL3315069)
Show SMILES CC(C)(O)c1ccc(cn1)-c1ccc2[C@H](c3cccc(F)c3Oc2n1)C(C)(C)C(=O)NC(N)=O |r|
Show InChI InChI=1S/C25H25FN4O4/c1-24(2,22(31)30-23(27)32)19-14-6-5-7-16(26)20(14)34-21-15(19)9-10-17(29-21)13-8-11-18(28-12-13)25(3,4)33/h5-12,19,33H,1-4H3,(H3,27,30,31,32)/t19-/m0/s1
106n/an/an/an/an/an/an/an/a
Bristol-Myers Squibb Company
Curated by ChEMBL
Assay Description
Binding affinity to progesterone receptor (unknown origin) by fluorescence polarization assay
Bioorg Med Chem Lett 24: 3268-73 (2014)
Article DOI: 10.1016/j.bmcl.2014.06.010
BindingDB Entry DOI: 10.7270/Q21N82SN
Glucocorticoid receptor
(Homo sapiens (Human))
BDBM50048347
(CHEMBL3315069)
Show SMILES CC(C)(O)c1ccc(cn1)-c1ccc2[C@H](c3cccc(F)c3Oc2n1)C(C)(C)C(=O)NC(N)=O |r|
Show InChI InChI=1S/C25H25FN4O4/c1-24(2,22(31)30-23(27)32)19-14-6-5-7-16(26)20(14)34-21-15(19)9-10-17(29-21)13-8-11-18(28-12-13)25(3,4)33/h5-12,19,33H,1-4H3,(H3,27,30,31,32)/t19-/m0/s1
n/an/an/an/a 107n/an/an/an/a
Bristol-Myers Squibb Company
Curated by ChEMBL
Assay Description
Agonist activity at glucocorticoid receptor in human HeLa cells assessed as NP-1 transactivation by luciferase reporter gene assay
Bioorg Med Chem Lett 24: 3268-73 (2014)
Article DOI: 10.1016/j.bmcl.2014.06.010
BindingDB Entry DOI: 10.7270/Q21N82SN
Glucocorticoid receptor
(Homo sapiens (Human))
BDBM50048347
(CHEMBL3315069)
Show SMILES CC(C)(O)c1ccc(cn1)-c1ccc2[C@H](c3cccc(F)c3Oc2n1)C(C)(C)C(=O)NC(N)=O |r|
Show InChI InChI=1S/C25H25FN4O4/c1-24(2,22(31)30-23(27)32)19-14-6-5-7-16(26)20(14)34-21-15(19)9-10-17(29-21)13-8-11-18(28-12-13)25(3,4)33/h5-12,19,33H,1-4H3,(H3,27,30,31,32)/t19-/m0/s1
n/an/an/an/a 199n/an/an/an/a
Bristol-Myers Squibb Company
Curated by ChEMBL
Assay Description
Agonist activity at glucocorticoid receptor in human whole blood assessed as inhibition of LPS-induced TNF production incubated for 20 hrs prior to L...
Bioorg Med Chem Lett 24: 3268-73 (2014)
Article DOI: 10.1016/j.bmcl.2014.06.010
BindingDB Entry DOI: 10.7270/Q21N82SN
Glucocorticoid receptor
(Homo sapiens (Human))
BDBM50048347
(CHEMBL3315069)
Show SMILES CC(C)(O)c1ccc(cn1)-c1ccc2[C@H](c3cccc(F)c3Oc2n1)C(C)(C)C(=O)NC(N)=O |r|
Show InChI InChI=1S/C25H25FN4O4/c1-24(2,22(31)30-23(27)32)19-14-6-5-7-16(26)20(14)34-21-15(19)9-10-17(29-21)13-8-11-18(28-12-13)25(3,4)33/h5-12,19,33H,1-4H3,(H3,27,30,31,32)/t19-/m0/s1
n/an/an/an/a 22n/an/an/an/a
Bristol-Myers Squibb Company
Curated by ChEMBL
Assay Description
Agonist activity at glucocorticoid receptor in human A549 cells assessed as AP-1 transrepression by luciferase reporter gene assay
Bioorg Med Chem Lett 24: 3268-73 (2014)
Article DOI: 10.1016/j.bmcl.2014.06.010
BindingDB Entry DOI: 10.7270/Q21N82SN
Glucocorticoid receptor
(Homo sapiens (Human))
BDBM50048347
(CHEMBL3315069)
Show SMILES CC(C)(O)c1ccc(cn1)-c1ccc2[C@H](c3cccc(F)c3Oc2n1)C(C)(C)C(=O)NC(N)=O |r|
Show InChI InChI=1S/C25H25FN4O4/c1-24(2,22(31)30-23(27)32)19-14-6-5-7-16(26)20(14)34-21-15(19)9-10-17(29-21)13-8-11-18(28-12-13)25(3,4)33/h5-12,19,33H,1-4H3,(H3,27,30,31,32)/t19-/m0/s1
n/an/an/an/a 15n/an/an/an/a
Bristol-Myers Squibb Company
Curated by ChEMBL
Assay Description
Agonist activity at glucocorticoid receptor in human A549 cells assessed as E-selectin transrepression by luciferase reporter gene assay
Bioorg Med Chem Lett 24: 3268-73 (2014)
Article DOI: 10.1016/j.bmcl.2014.06.010
BindingDB Entry DOI: 10.7270/Q21N82SN