BDBM50048482 CHEMBL3310163
SMILES: CCOc1ccc(Cc2nc3cc(ccc3n2CCCCN(C)CCCCn2c(Cc3ccc(OCC)cc3)nc3cc(ccc23)C(=O)N(CC)CC)C(=O)N(CC)CC)cc1
InChI Key: InChIKey=CDZMVIDKSVUZAX-UHFFFAOYSA-N
Data: 1 EC50
Activity Spreadsheet -- Enzyme Inhibition Constant Data from BindingDB
Found 1 hit for monomerid = 50048482
Trg + Lig
Ki
nM
ΔG°
kcal/mole
IC50
nM
Kd
nM
EC50/IC50
nM
koff
s-1
kon
M-1s-1
pHTemp
°C
Cannabinoid receptor 2
(Homo sapiens (Human))
BDBM50048482
(CHEMBL3310163)
Show SMILES CCOc1ccc(Cc2nc3cc(ccc3n2CCCCN(C)CCCCn2c(Cc3ccc(OCC)cc3)nc3cc(ccc23)C(=O)N(CC)CC)C(=O)N(CC)CC)cc1
Show InChI InChI=1S/C51H67N7O4/c1-8-55(9-2)50(59)40-22-28-46-44(36-40)52-48(34-38-18-24-42(25-19-38)61-12-5)57(46)32-16-14-30-54(7)31-15-17-33-58-47-29-23-41(51(60)56(10-3)11-4)37-45(47)53-49(58)35-39-20-26-43(27-21-39)62-13-6/h18-29,36-37H,8-17,30-35H2,1-7H3
Reactome pathway
n/an/an/an/a 5.75E+4n/an/an/an/a
Julius-Maximilians-Universit£t W£rzburg
Curated by ChEMBL
Assay Description
Inverse agonist activity at human CB2 receptor expressed in Sf9 cells coexpressing Galpha i2 assessed as Galpha GTPase activity using [gamma-33P]GTP ...
Bioorg Med Chem 22: 3938-46 (2014)
Article DOI: 10.1016/j.bmc.2014.06.008
BindingDB Entry DOI: 10.7270/Q2862J3W