BDBM50048817 2-[6-(4-Benzo[d]isothiazol-3-yl-piperazin-1-yl)-hexyl]-isoindole-1,3-dione::CHEMBL38409
SMILES: O=C1N(CCCCCCN2CCN(CC2)c2nsc3ccccc23)C(=O)c2ccccc12
InChI Key: InChIKey=ZWXUIJOENHRFLU-UHFFFAOYSA-N
Data: 5 KI  2 IC50
Activity Spreadsheet -- Enzyme Inhibition Constant Data from BindingDB
Found 7 hits for monomerid = 50048817
Trg + Lig
Ki
nM
ΔG°
kcal/mole
IC50
nM
Kd
nM
EC50/IC50
nM
koff
s-1
kon
M-1s-1
pHTemp
°C
D(2) dopamine receptor
(Homo sapiens (Human))
BDBM50048817
(2-[6-(4-Benzo[d]isothiazol-3-yl-piperazin-1-yl)-he...)
Show SMILES O=C1N(CCCCCCN2CCN(CC2)c2nsc3ccccc23)C(=O)c2ccccc12
Show InChI InChI=1S/C25H28N4O2S/c30-24-19-9-3-4-10-20(19)25(31)29(24)14-8-2-1-7-13-27-15-17-28(18-16-27)23-21-11-5-6-12-22(21)32-26-23/h3-6,9-12H,1-2,7-8,13-18H2
Reactome pathway
10n/an/an/an/an/an/an/an/a
Cracow University of Technology
Curated by ChEMBL
Assay Description
Displacement of [3H]-raclopride from human D2L receptor expressed in HEK293 cell membranes measured after 1 hr by microbeta counting method
Bioorg Med Chem 28: (2020)
5-hydroxytryptamine receptor 1A
(Homo sapiens (Human))
BDBM50048817
(2-[6-(4-Benzo[d]isothiazol-3-yl-piperazin-1-yl)-he...)
Show SMILES O=C1N(CCCCCCN2CCN(CC2)c2nsc3ccccc23)C(=O)c2ccccc12
Show InChI InChI=1S/C25H28N4O2S/c30-24-19-9-3-4-10-20(19)25(31)29(24)14-8-2-1-7-13-27-15-17-28(18-16-27)23-21-11-5-6-12-22(21)32-26-23/h3-6,9-12H,1-2,7-8,13-18H2
18n/an/an/an/an/an/an/an/a
Cracow University of Technology
Curated by ChEMBL
Assay Description
Displacement of [3H]8-OH-DPAT from human 5HT1A receptor expressed in HEK293 cell membranes measured after 1 hr by microbeta counting method
Bioorg Med Chem 28: (2020)
5-hydroxytryptamine receptor 2A
(Homo sapiens (Human))
BDBM50048817
(2-[6-(4-Benzo[d]isothiazol-3-yl-piperazin-1-yl)-he...)
Show SMILES O=C1N(CCCCCCN2CCN(CC2)c2nsc3ccccc23)C(=O)c2ccccc12
Show InChI InChI=1S/C25H28N4O2S/c30-24-19-9-3-4-10-20(19)25(31)29(24)14-8-2-1-7-13-27-15-17-28(18-16-27)23-21-11-5-6-12-22(21)32-26-23/h3-6,9-12H,1-2,7-8,13-18H2
Reactome pathway
24n/an/an/an/an/an/an/an/a
Cracow University of Technology
Curated by ChEMBL
Assay Description
Displacement of [3H]-ketanserin from recombinant human 5HT2A receptor expressed in CHOK1 cell membranes measured after 1 hr by microbeta counting met...
Bioorg Med Chem 28: (2020)
5-hydroxytryptamine receptor 7
(Homo sapiens (Human))
BDBM50048817
(2-[6-(4-Benzo[d]isothiazol-3-yl-piperazin-1-yl)-he...)
Show SMILES O=C1N(CCCCCCN2CCN(CC2)c2nsc3ccccc23)C(=O)c2ccccc12
Show InChI InChI=1S/C25H28N4O2S/c30-24-19-9-3-4-10-20(19)25(31)29(24)14-8-2-1-7-13-27-15-17-28(18-16-27)23-21-11-5-6-12-22(21)32-26-23/h3-6,9-12H,1-2,7-8,13-18H2
Reactome pathway
114n/an/an/an/an/an/an/an/a
Cracow University of Technology
Curated by ChEMBL
Assay Description
Displacement of [3H]-5-CT from human 5HT7b receptor expressed in HEK293 cell membranes measured after 1 hr by microbeta counting method
Bioorg Med Chem 28: (2020)
5-hydroxytryptamine receptor 6
(Homo sapiens (Human))
BDBM50048817
(2-[6-(4-Benzo[d]isothiazol-3-yl-piperazin-1-yl)-he...)
Show SMILES O=C1N(CCCCCCN2CCN(CC2)c2nsc3ccccc23)C(=O)c2ccccc12
Show InChI InChI=1S/C25H28N4O2S/c30-24-19-9-3-4-10-20(19)25(31)29(24)14-8-2-1-7-13-27-15-17-28(18-16-27)23-21-11-5-6-12-22(21)32-26-23/h3-6,9-12H,1-2,7-8,13-18H2
Reactome pathway
160n/an/an/an/an/an/an/an/a
Cracow University of Technology
Curated by ChEMBL
Assay Description
Displacement of [3H]-LSD from human 5HT6 receptor expressed in HEK293 cell membranes measured after 1 hr by microbeta counting method
Bioorg Med Chem 28: (2020)
D(2) dopamine receptor
(Rattus norvegicus (rat))
BDBM50048817
(2-[6-(4-Benzo[d]isothiazol-3-yl-piperazin-1-yl)-he...)
Show SMILES O=C1N(CCCCCCN2CCN(CC2)c2nsc3ccccc23)C(=O)c2ccccc12
Show InChI InChI=1S/C25H28N4O2S/c30-24-19-9-3-4-10-20(19)25(31)29(24)14-8-2-1-7-13-27-15-17-28(18-16-27)23-21-11-5-6-12-22(21)32-26-23/h3-6,9-12H,1-2,7-8,13-18H2
Reactome pathway
n/an/a 9.20n/an/an/an/an/an/a
Glaxo Wellcome Inc.
Curated by ChEMBL
Assay Description
Inhibition of [3H]-raclopride binding at Dopamine receptor D2 from rat striata.
J Med Chem 39: 149-57 (1996)
Article DOI: 10.1021/jm9502201
BindingDB Entry DOI: 10.7270/Q2TQ60MN
5-hydroxytryptamine receptor 1A
(Rattus norvegicus (rat))
BDBM50048817
(2-[6-(4-Benzo[d]isothiazol-3-yl-piperazin-1-yl)-he...)
Show SMILES O=C1N(CCCCCCN2CCN(CC2)c2nsc3ccccc23)C(=O)c2ccccc12
Show InChI InChI=1S/C25H28N4O2S/c30-24-19-9-3-4-10-20(19)25(31)29(24)14-8-2-1-7-13-27-15-17-28(18-16-27)23-21-11-5-6-12-22(21)32-26-23/h3-6,9-12H,1-2,7-8,13-18H2
n/an/a 0.760n/an/an/an/an/an/a
Glaxo Wellcome Inc.
Curated by ChEMBL
Assay Description
Inhibition of [3H]-8-OH-DPAT binding at serotonin 5-hydroxytryptamine 1A receptor from rat hippocampus tissue.
J Med Chem 39: 149-57 (1996)
Article DOI: 10.1021/jm9502201
BindingDB Entry DOI: 10.7270/Q2TQ60MN