BDBM50048818 2-[5-(4-Benzo[d]isothiazol-3-yl-piperazin-1-yl)-pentyl]-isoindole-1,3-dione::CHEMBL41536
SMILES: O=C1N(CCCCCN2CCN(CC2)c2nsc3ccccc23)C(=O)c2ccccc12
InChI Key: InChIKey=AGZPUSHGNOUMEV-UHFFFAOYSA-N
Data: 2 IC50
Activity Spreadsheet -- Enzyme Inhibition Constant Data from BindingDB
Found 2 hits for monomerid = 50048818
Trg + Lig
Ki
nM
ΔG°
kcal/mole
IC50
nM
Kd
nM
EC50/IC50
nM
koff
s-1
kon
M-1s-1
pHTemp
°C
5-hydroxytryptamine receptor 1A
(Rattus norvegicus (rat))
BDBM50048818
(2-[5-(4-Benzo[d]isothiazol-3-yl-piperazin-1-yl)-pe...)
Show SMILES O=C1N(CCCCCN2CCN(CC2)c2nsc3ccccc23)C(=O)c2ccccc12
Show InChI InChI=1S/C24H26N4O2S/c29-23-18-8-2-3-9-19(18)24(30)28(23)13-7-1-6-12-26-14-16-27(17-15-26)22-20-10-4-5-11-21(20)31-25-22/h2-5,8-11H,1,6-7,12-17H2
n/an/a 2n/an/an/an/an/an/a
Glaxo Wellcome Inc.
Curated by ChEMBL
Assay Description
Inhibition of [3H]-8-OH-DPAT binding at serotonin 5-hydroxytryptamine 1A receptor from rat hippocampus tissue.
J Med Chem 39: 149-57 (1996)
Article DOI: 10.1021/jm9502201
BindingDB Entry DOI: 10.7270/Q2TQ60MN
D(2) dopamine receptor
(Rattus norvegicus (rat))
BDBM50048818
(2-[5-(4-Benzo[d]isothiazol-3-yl-piperazin-1-yl)-pe...)
Show SMILES O=C1N(CCCCCN2CCN(CC2)c2nsc3ccccc23)C(=O)c2ccccc12
Show InChI InChI=1S/C24H26N4O2S/c29-23-18-8-2-3-9-19(18)24(30)28(23)13-7-1-6-12-26-14-16-27(17-15-26)22-20-10-4-5-11-21(20)31-25-22/h2-5,8-11H,1,6-7,12-17H2
Reactome pathway
n/an/a 21n/an/an/an/an/an/a
Glaxo Wellcome Inc.
Curated by ChEMBL
Assay Description
Inhibition of [3H]-raclopride binding at Dopamine receptor D2 from rat striata.
J Med Chem 39: 149-57 (1996)
Article DOI: 10.1021/jm9502201
BindingDB Entry DOI: 10.7270/Q2TQ60MN