BDBM50048852 CHEMBL3310328
SMILES: COc1cc(C)cc(c1)-c1c(cnn1C)-c1cc(nc(n1)-c1cccnc1)N1CCOCC1
InChI Key: InChIKey=LXLIYOZNGGATIL-UHFFFAOYSA-N
Data: 1 IC50
Activity Spreadsheet -- Enzyme Inhibition Constant Data from BindingDB
Found 1 hit for monomerid = 50048852
Trg + Lig
Ki
nM
ΔG°
kcal/mole
IC50
nM
Kd
nM
EC50/IC50
nM
koff
s-1
kon
M-1s-1
pHTemp
°C
Proto-oncogene tyrosine-protein kinase ROS
(Homo sapiens (Human))
BDBM50048852
(CHEMBL3310328)
Show SMILES COc1cc(C)cc(c1)-c1c(cnn1C)-c1cc(nc(n1)-c1cccnc1)N1CCOCC1
Show InChI InChI=1S/C25H26N6O2/c1-17-11-19(13-20(12-17)32-3)24-21(16-27-30(24)2)22-14-23(31-7-9-33-10-8-31)29-25(28-22)18-5-4-6-26-15-18/h4-6,11-16H,7-10H2,1-3H3
n/an/a 104n/an/an/an/an/an/a
Yonsei University
Curated by ChEMBL
Assay Description
Inhibition of ROS1 (unknown origin) assessed as remaining activity
Bioorg Med Chem 22: 3871-8 (2014)
Article DOI: 10.1016/j.bmc.2014.06.020
BindingDB Entry DOI: 10.7270/Q2765H0Z