BDBM50048968 (R)-2-({(S)-2-[(S)-2-((R)-2-Amino-3-mercapto-propylamino)-3,3-dimethyl-butyryl]-1,2,3,4-tetrahydro-isoquinoline-3-carbonyl}-amino)-4-methoxy-butyric acid::CHEMBL311507
SMILES: COCC[C@@H](NC(=O)[C@@H]1Cc2ccccc2CN1C(=O)[C@@H](NC[C@@H](N)CS)C(C)(C)C)C(O)=O
InChI Key: InChIKey=FZJOMPQKENNHGD-YSTOQKLRSA-N
Data: 2 IC50
Activity Spreadsheet -- Enzyme Inhibition Constant Data from BindingDB
Found 2 hits for monomerid = 50048968
Trg + Lig
Ki
nM
ΔG°
kcal/mole
IC50
nM
Kd
nM
EC50/IC50
nM
koff
s-1
kon
M-1s-1
pHTemp
°C
Geranylgeranyl transferase type I beta subunit/Protein Farnesyltransferase (PFT)
(Homo sapiens (Human))
BDBM50048968
((R)-2-({(S)-2-[(S)-2-((R)-2-Amino-3-mercapto-propy...)
Show SMILES COCC[C@@H](NC(=O)[C@@H]1Cc2ccccc2CN1C(=O)[C@@H](NC[C@@H](N)CS)C(C)(C)C)C(O)=O
Show InChI InChI=1S/C24H38N4O5S/c1-24(2,3)20(26-12-17(25)14-34)22(30)28-13-16-8-6-5-7-15(16)11-19(28)21(29)27-18(23(31)32)9-10-33-4/h5-8,17-20,26,34H,9-14,25H2,1-4H3,(H,27,29)(H,31,32)/t17-,18-,19+,20-/m1/s1
n/an/a 22n/an/an/an/an/an/a
Bristol-Myers Squibb Pharmaceutical Research Institute
Curated by ChEMBL
Assay Description
In vitro inhibition of Geranylgeranyl transferase type I
J Med Chem 39: 224-36 (1996)
Article DOI: 10.1021/jm950642a
BindingDB Entry DOI: 10.7270/Q2610ZDS
Protein Farnesyltransferase (PFT) Chain B
(Homo sapiens (Human))
BDBM50048968
((R)-2-({(S)-2-[(S)-2-((R)-2-Amino-3-mercapto-propy...)
Show SMILES COCC[C@@H](NC(=O)[C@@H]1Cc2ccccc2CN1C(=O)[C@@H](NC[C@@H](N)CS)C(C)(C)C)C(O)=O
Show InChI InChI=1S/C24H38N4O5S/c1-24(2,3)20(26-12-17(25)14-34)22(30)28-13-16-8-6-5-7-15(16)11-19(28)21(29)27-18(23(31)32)9-10-33-4/h5-8,17-20,26,34H,9-14,25H2,1-4H3,(H,27,29)(H,31,32)/t17-,18-,19+,20-/m1/s1
n/an/a 1.40n/an/an/an/an/an/a
Bristol-Myers Squibb Pharmaceutical Research Institute
Curated by ChEMBL
Assay Description
In vitro inhibitory activity against Farnesyltransferase
J Med Chem 39: 224-36 (1996)
Article DOI: 10.1021/jm950642a
BindingDB Entry DOI: 10.7270/Q2610ZDS