BDBM50049018 5-(3,4-Dichloro-phenyl)-6-(4-methanesulfonyl-phenyl)-spiro[2.4]hept-5-ene::CHEMBL558340
SMILES: CS(=O)(=O)c1ccc(cc1)C1=C(CC2(CC2)C1)c1ccc(Cl)c(Cl)c1
InChI Key: InChIKey=OGJRYKHFBVZBCT-UHFFFAOYSA-N
Data: 3 IC50
Activity Spreadsheet -- Enzyme Inhibition Constant Data from BindingDB
Found 3 hits for monomerid = 50049018
Trg + Lig
Ki
nM
ΔG°
kcal/mole
IC50
nM
Kd
nM
EC50/IC50
nM
koff
s-1
kon
M-1s-1
pHTemp
°C
Cyclooxygenase-1 (COX-1)
(Homo sapiens (Human))
BDBM50049018
(5-(3,4-Dichloro-phenyl)-6-(4-methanesulfonyl-pheny...)
Show SMILES CS(=O)(=O)c1ccc(cc1)C1=C(CC2(CC2)C1)c1ccc(Cl)c(Cl)c1 |t:11|
Show InChI InChI=1S/C20H18Cl2O2S/c1-25(23,24)15-5-2-13(3-6-15)16-11-20(8-9-20)12-17(16)14-4-7-18(21)19(22)10-14/h2-7,10H,8-9,11-12H2,1H3
n/an/a>1.00E+5n/an/an/an/an/an/a
Searle Research and Development
Curated by ChEMBL
Assay Description
Inhibitory activity against prostaglandin G/H synthase 1 (COX-1).
J Med Chem 39: 253-66 (1996)
Article DOI: 10.1021/jm950664x
BindingDB Entry DOI: 10.7270/Q2XG9Q6M
Cyclooxygenase
(Homo sapiens (Human))
BDBM50049018
(5-(3,4-Dichloro-phenyl)-6-(4-methanesulfonyl-pheny...)
Show SMILES CS(=O)(=O)c1ccc(cc1)C1=C(CC2(CC2)C1)c1ccc(Cl)c(Cl)c1 |t:11|
Show InChI InChI=1S/C20H18Cl2O2S/c1-25(23,24)15-5-2-13(3-6-15)16-11-20(8-9-20)12-17(16)14-4-7-18(21)19(22)10-14/h2-7,10H,8-9,11-12H2,1H3
NCI pathway
Reactome pathway
n/an/a 3.02n/an/an/an/an/an/a
Universit£ de Lille 2
Curated by ChEMBL
Assay Description
Inhibition of human Prostaglandin G/H synthase 2
J Med Chem 44: 3223-30 (2001)
BindingDB Entry DOI: 10.7270/Q2736S4D
Cyclooxygenase
(Homo sapiens (Human))
BDBM50049018
(5-(3,4-Dichloro-phenyl)-6-(4-methanesulfonyl-pheny...)
Show SMILES CS(=O)(=O)c1ccc(cc1)C1=C(CC2(CC2)C1)c1ccc(Cl)c(Cl)c1 |t:11|
Show InChI InChI=1S/C20H18Cl2O2S/c1-25(23,24)15-5-2-13(3-6-15)16-11-20(8-9-20)12-17(16)14-4-7-18(21)19(22)10-14/h2-7,10H,8-9,11-12H2,1H3
NCI pathway
Reactome pathway
n/an/a 3n/an/an/an/an/an/a
Searle Research and Development
Curated by ChEMBL
Assay Description
Inhibitory activity of the compound against prostaglandin G/H synthase 2 (COX-2).
J Med Chem 39: 253-66 (1996)
Article DOI: 10.1021/jm950664x
BindingDB Entry DOI: 10.7270/Q2XG9Q6M