BDBM50049027 4-[6-(3,5-Dichloro-4-methoxy-phenyl)-spiro[2.4]hept-5-en-5-yl]-benzenesulfonamide::CHEMBL88493
SMILES: COc1c(Cl)cc(cc1Cl)C1=C(CC2(CC2)C1)c1ccc(cc1)S(N)(=O)=O
InChI Key: InChIKey=MBABADMQCLGYMQ-UHFFFAOYSA-N
Data: 3 IC50
Activity Spreadsheet -- Enzyme Inhibition Constant Data from BindingDB
Found 3 hits for monomerid = 50049027
Trg + Lig
Ki
nM
ΔG°
kcal/mole
IC50
nM
Kd
nM
EC50/IC50
nM
koff
s-1
kon
M-1s-1
pHTemp
°C
Cyclooxygenase-1 (COX-1)
(Homo sapiens (Human))
BDBM50049027
(4-[6-(3,5-Dichloro-4-methoxy-phenyl)-spiro[2.4]hep...)
Show SMILES COc1c(Cl)cc(cc1Cl)C1=C(CC2(CC2)C1)c1ccc(cc1)S(N)(=O)=O |t:11|
Show InChI InChI=1S/C20H19Cl2NO3S/c1-26-19-17(21)8-13(9-18(19)22)16-11-20(6-7-20)10-15(16)12-2-4-14(5-3-12)27(23,24)25/h2-5,8-9H,6-7,10-11H2,1H3,(H2,23,24,25)
n/an/a 1.64E+4n/an/an/an/an/an/a
Searle Research and Development
Curated by ChEMBL
Assay Description
Inhibitory activity against prostaglandin G/H synthase 1 (COX-1).
J Med Chem 39: 253-66 (1996)
Article DOI: 10.1021/jm950664x
BindingDB Entry DOI: 10.7270/Q2XG9Q6M
Cyclooxygenase
(Homo sapiens (Human))
BDBM50049027
(4-[6-(3,5-Dichloro-4-methoxy-phenyl)-spiro[2.4]hep...)
Show SMILES COc1c(Cl)cc(cc1Cl)C1=C(CC2(CC2)C1)c1ccc(cc1)S(N)(=O)=O |t:11|
Show InChI InChI=1S/C20H19Cl2NO3S/c1-26-19-17(21)8-13(9-18(19)22)16-11-20(6-7-20)10-15(16)12-2-4-14(5-3-12)27(23,24)25/h2-5,8-9H,6-7,10-11H2,1H3,(H2,23,24,25)
NCI pathway
Reactome pathway
n/an/a 3.98n/an/an/an/an/an/a
Universit£ de Lille 2
Curated by ChEMBL
Assay Description
Inhibition of human Prostaglandin G/H synthase 2
J Med Chem 44: 3223-30 (2001)
BindingDB Entry DOI: 10.7270/Q2736S4D
Cyclooxygenase
(Homo sapiens (Human))
BDBM50049027
(4-[6-(3,5-Dichloro-4-methoxy-phenyl)-spiro[2.4]hep...)
Show SMILES COc1c(Cl)cc(cc1Cl)C1=C(CC2(CC2)C1)c1ccc(cc1)S(N)(=O)=O |t:11|
Show InChI InChI=1S/C20H19Cl2NO3S/c1-26-19-17(21)8-13(9-18(19)22)16-11-20(6-7-20)10-15(16)12-2-4-14(5-3-12)27(23,24)25/h2-5,8-9H,6-7,10-11H2,1H3,(H2,23,24,25)
NCI pathway
Reactome pathway
n/an/a 4n/an/an/an/an/an/a
Searle Research and Development
Curated by ChEMBL
Assay Description
Inhibitory activity of the compound against prostaglandin G/H synthase 2 (COX-2).
J Med Chem 39: 253-66 (1996)
Article DOI: 10.1021/jm950664x
BindingDB Entry DOI: 10.7270/Q2XG9Q6M