BDBM50049236 (+/-)-1-Phosphono-4-(3-phenoxyphenyl)butylsulfonic Acid Tripotassium Salt::CHEMBL351151::Tripotassium salt of 4-(3-Phenoxy-phenyl)-1-phosphono-butane-1-sulfonic acid::potassium salt of 4-(3-Phenoxy-phenyl)-1-phosphono-butane-1-sulfonic acid
SMILES: [O-]P([O-])(=O)C(CCCc1cccc(Oc2ccccc2)c1)S([O-])(=O)=O
InChI Key: InChIKey=RCGCZPXSRLLKCK-UHFFFAOYSA-K
Data: 1 KI  5 IC50
Activity Spreadsheet -- Enzyme Inhibition Constant Data from BindingDB
Found 6 hits for monomerid = 50049236
Trg + Lig
Ki
nM
ΔG°
kcal/mole
IC50
nM
Kd
nM
EC50/IC50
nM
koff
s-1
kon
M-1s-1
pHTemp
°C
Dehydrosqualene synthase
(Staphylococcus aureus)
BDBM50049236
((+/-)-1-Phosphono-4-(3-phenoxyphenyl)butylsulfonic...)
Show SMILES [O-]P([O-])(=O)C(CCCc1cccc(Oc2ccccc2)c1)S([O-])(=O)=O
Show InChI InChI=1S/C16H19O7PS/c17-24(18,19)16(25(20,21)22)11-5-7-13-6-4-10-15(12-13)23-14-8-2-1-3-9-14/h1-4,6,8-10,12,16H,5,7,11H2,(H2,17,18,19)(H,20,21,22)/p-3
1.5n/an/an/an/an/an/an/an/a
Case Western Reserve University
Curated by ChEMBL
Assay Description
Inhibition of Staphylococcus aureus ATCC 27659 histidine-tagged full length CrtM expressed in Escherichia coli BL21(DE3) cells assessed as decrease i...
J Med Chem 60: 3221-3240 (2017)
Article DOI: 10.1021/acs.jmedchem.6b01243
BindingDB Entry DOI: 10.7270/Q2M90BXJ
Squalene synthetase
(Homo sapiens (Human))
BDBM50049236
((+/-)-1-Phosphono-4-(3-phenoxyphenyl)butylsulfonic...)
Show SMILES [O-]P([O-])(=O)C(CCCc1cccc(Oc2ccccc2)c1)S([O-])(=O)=O
Show InChI InChI=1S/C16H19O7PS/c17-24(18,19)16(25(20,21)22)11-5-7-13-6-4-10-15(12-13)23-14-8-2-1-3-9-14/h1-4,6,8-10,12,16H,5,7,11H2,(H2,17,18,19)(H,20,21,22)/p-3
Reactome pathway
n/an/a 23n/an/an/an/an/an/a
University of Illinois at Urbana-Champaign
Curated by ChEMBL
Assay Description
Inhibition of human recombinant squalene synthase expressed in Escherichia coli BL21 (DE3) cells assessed as formation of 1,10-dioic acid metabolite ...
J Med Chem 52: 976-88 (2009)
Article DOI: 10.1021/jm801023u
BindingDB Entry DOI: 10.7270/Q2VM4C87
Dehydrosqualene synthase
(Staphylococcus aureus)
BDBM50049236
((+/-)-1-Phosphono-4-(3-phenoxyphenyl)butylsulfonic...)
Show SMILES [O-]P([O-])(=O)C(CCCc1cccc(Oc2ccccc2)c1)S([O-])(=O)=O
Show InChI InChI=1S/C16H19O7PS/c17-24(18,19)16(25(20,21)22)11-5-7-13-6-4-10-15(12-13)23-14-8-2-1-3-9-14/h1-4,6,8-10,12,16H,5,7,11H2,(H2,17,18,19)(H,20,21,22)/p-3
n/an/a 110n/an/an/an/an/an/a
East China University of Science and Technology
Curated by ChEMBL
Assay Description
Inhibition of CrtM in Staphylococcus aureus assessed as reduction in staphyloxanthin levels after 72 hrs by spectrophotometric method
J Med Chem 61: 224-250 (2018)
Article DOI: 10.1021/acs.jmedchem.7b01300
BindingDB Entry DOI: 10.7270/Q289189X
Dehydrosqualene synthase
(Staphylococcus aureus)
BDBM50049236
((+/-)-1-Phosphono-4-(3-phenoxyphenyl)butylsulfonic...)
Show SMILES [O-]P([O-])(=O)C(CCCc1cccc(Oc2ccccc2)c1)S([O-])(=O)=O
Show InChI InChI=1S/C16H19O7PS/c17-24(18,19)16(25(20,21)22)11-5-7-13-6-4-10-15(12-13)23-14-8-2-1-3-9-14/h1-4,6,8-10,12,16H,5,7,11H2,(H2,17,18,19)(H,20,21,22)/p-3
n/an/a 83n/an/an/an/an/an/a
East China University of Science and Technology
Curated by ChEMBL
Assay Description
Inhibition of Staphylococcus aureus ATCC 27659 full length His-tagged dehydrosqualene synthase expressed in Escherichia coli BL21 (DE3) cells assesse...
J Med Chem 59: 4831-48 (2016)
BindingDB Entry DOI: 10.7270/Q2FQ9ZKH
Squalene synthetase
(Rattus norvegicus)
BDBM50049236
((+/-)-1-Phosphono-4-(3-phenoxyphenyl)butylsulfonic...)
Show SMILES [O-]P([O-])(=O)C(CCCc1cccc(Oc2ccccc2)c1)S([O-])(=O)=O
Show InChI InChI=1S/C16H19O7PS/c17-24(18,19)16(25(20,21)22)11-5-7-13-6-4-10-15(12-13)23-14-8-2-1-3-9-14/h1-4,6,8-10,12,16H,5,7,11H2,(H2,17,18,19)(H,20,21,22)/p-3
Reactome pathway
n/an/a 169n/an/an/an/an/an/a
Bristol-Myers Squibb Pharmaceutical Research Institute
Curated by ChEMBL
Assay Description
Inhibitory activity against rat liver microsomal squalene synthase was determined using [3H]-FPP as radioligand
J Med Chem 39: 657-60 (1996)
Article DOI: 10.1021/jm9507340
BindingDB Entry DOI: 10.7270/Q2N29W1T
Dehydrosqualene synthase
(Staphylococcus aureus)
BDBM50049236
((+/-)-1-Phosphono-4-(3-phenoxyphenyl)butylsulfonic...)
Show SMILES [O-]P([O-])(=O)C(CCCc1cccc(Oc2ccccc2)c1)S([O-])(=O)=O
Show InChI InChI=1S/C16H19O7PS/c17-24(18,19)16(25(20,21)22)11-5-7-13-6-4-10-15(12-13)23-14-8-2-1-3-9-14/h1-4,6,8-10,12,16H,5,7,11H2,(H2,17,18,19)(H,20,21,22)/p-3
n/an/a 7.90E+3n/an/an/an/an/an/a
University of Illinois at Urbana-Champaign
Curated by ChEMBL
Assay Description
Inhibition of Staphylococcus aureus dehydrosqualene synthase expressed in Escherichia coli BL21 (DE3) cells by continuous spectrophotometric assay
J Med Chem 52: 976-88 (2009)
Article DOI: 10.1021/jm801023u
BindingDB Entry DOI: 10.7270/Q2VM4C87