BDBM50049345 CHEMBL423824::N-[1-{[Acetyl-(3-methoxy-benzyl)-amino]-methyl}-2-(1H-indol-3-yl)-ethyl]-2-(4-phenyl-piperazin-1-yl)-acetamide
SMILES: COc1cccc(CN(CC(Cc2c[nH]c3ccccc23)NC(=O)CN2CCN(CC2)c2ccccc2)C(C)=O)c1
InChI Key: InChIKey=UEMMIMGZPQLHRL-UHFFFAOYSA-N
Data: 1 IC50
Activity Spreadsheet -- Enzyme Inhibition Constant Data from BindingDB
Found 1 hit for monomerid = 50049345
Trg + Lig
Ki
nM
ΔG°
kcal/mole
IC50
nM
Kd
nM
EC50/IC50
nM
koff
s-1
kon
M-1s-1
pHTemp
°C
Neurokinin 1 receptor
(Homo sapiens (Human))
BDBM50049345
(CHEMBL423824 | N-[1-{[Acetyl-(3-methoxy-benzyl)-am...)
Show SMILES COc1cccc(CN(CC(Cc2c[nH]c3ccccc23)NC(=O)CN2CCN(CC2)c2ccccc2)C(C)=O)c1
Show InChI InChI=1S/C33H39N5O3/c1-25(39)38(22-26-9-8-12-30(19-26)41-2)23-28(20-27-21-34-32-14-7-6-13-31(27)32)35-33(40)24-36-15-17-37(18-16-36)29-10-4-3-5-11-29/h3-14,19,21,28,34H,15-18,20,22-24H2,1-2H3,(H,35,40)
Reactome pathway
n/an/a 4.60n/an/an/an/an/an/a
Lilly Research Laboratories
Curated by ChEMBL
Assay Description
Inhibitory activity against Tachykinin receptor 1 in human IM-9 cells using [125I]-labeled Boltan-Hunter substance P as radioligand
J Med Chem 39: 736-48 (1996)
Article DOI: 10.1021/jm950616c
BindingDB Entry DOI: 10.7270/Q20864C7