BDBM50049473 CHEMBL300856::[(2S,3S)-2-(3,5-Bis-trifluoromethyl-benzyloxy)-3-phenyl-morpholin-4-yl]-acetic acid methyl ester
SMILES: COC(=O)CN1CCO[C@H](OCc2cc(cc(c2)C(F)(F)F)C(F)(F)F)[C@@H]1c1ccccc1
InChI Key: InChIKey=HKQKWZAMVUVBGL-VQTJNVASSA-N
Data: 1 IC50
Activity Spreadsheet -- Enzyme Inhibition Constant Data from BindingDB
Found 1 hit for monomerid = 50049473
Trg + Lig
Ki
nM
ΔG°
kcal/mole
IC50
nM
Kd
nM
EC50/IC50
nM
koff
s-1
kon
M-1s-1
pHTemp
°C
Neurokinin 1 receptor
(Homo sapiens (Human))
BDBM50049473
(CHEMBL300856 | [(2S,3S)-2-(3,5-Bis-trifluoromethyl...)
Show SMILES COC(=O)CN1CCO[C@H](OCc2cc(cc(c2)C(F)(F)F)C(F)(F)F)[C@@H]1c1ccccc1
Show InChI InChI=1S/C22H21F6NO4/c1-31-18(30)12-29-7-8-32-20(19(29)15-5-3-2-4-6-15)33-13-14-9-16(21(23,24)25)11-17(10-14)22(26,27)28/h2-6,9-11,19-20H,7-8,12-13H2,1H3/t19-,20+/m0/s1
Reactome pathway
n/an/a 1.60n/an/an/an/an/an/a
Merck Research Laboratories
Curated by ChEMBL
Assay Description
Displacement of [125I]-labeled SP from human Tachykinin receptor 1 expressed in CHO cells
J Med Chem 39: 1760-2 (1996)
Article DOI: 10.1021/jm950654w
BindingDB Entry DOI: 10.7270/Q2GB2346