BDBM50049511 5-Bromo-4-methoxy-2-((1S,2R)-2-methyl-6-methylene-cyclohexylmethyl)-phenol::CHEMBL51788
SMILES: COc1cc(C[C@H]2[C@H](C)CCCC2=C)c(O)cc1Br
InChI Key: InChIKey=HXJXFIBSBUSEJX-DGCLKSJQSA-N
Data: 3 KI  2 IC50  1 EC50
Activity Spreadsheet -- Enzyme Inhibition Constant Data from BindingDB
Found 6 hits for monomerid = 50049511
Trg + Lig
Ki
nM
ΔG°
kcal/mole
IC50
nM
Kd
nM
EC50/IC50
nM
koff
s-1
kon
M-1s-1
pHTemp
°C
Progesterone receptor
(Homo sapiens (Human))
BDBM50049511
(5-Bromo-4-methoxy-2-((1S,2R)-2-methyl-6-methylene-...)
Show SMILES COc1cc(C[C@H]2[C@H](C)CCCC2=C)c(O)cc1Br
Show InChI InChI=1S/C16H21BrO2/c1-10-5-4-6-11(2)13(10)7-12-8-16(19-3)14(17)9-15(12)18/h8-9,11,13,18H,1,4-7H2,2-3H3/t11-,13-/m1/s1
69n/an/an/an/an/an/an/an/a
Ligand Pharmaceuticals, Inc.
Curated by ChEMBL
Assay Description
Binding affinity determined for human Progesterone receptor A isoform
J Med Chem 39: 1778-89 (1996)
Article DOI: 10.1021/jm950747d
BindingDB Entry DOI: 10.7270/Q2416XQ2
Androgen Receptor
(Homo sapiens (Human))
BDBM50049511
(5-Bromo-4-methoxy-2-((1S,2R)-2-methyl-6-methylene-...)
Show SMILES COc1cc(C[C@H]2[C@H](C)CCCC2=C)c(O)cc1Br
Show InChI InChI=1S/C16H21BrO2/c1-10-5-4-6-11(2)13(10)7-12-8-16(19-3)14(17)9-15(12)18/h8-9,11,13,18H,1,4-7H2,2-3H3/t11-,13-/m1/s1
NCI pathway
Reactome pathway
570n/an/an/an/an/an/an/an/a
Ligand Pharmaceuticals, Inc.
Curated by ChEMBL
Assay Description
Binding affinity determined against human Androgen receptor
J Med Chem 39: 1778-89 (1996)
Article DOI: 10.1021/jm950747d
BindingDB Entry DOI: 10.7270/Q2416XQ2
Glucocorticoid receptor
(Homo sapiens (Human))
BDBM50049511
(5-Bromo-4-methoxy-2-((1S,2R)-2-methyl-6-methylene-...)
Show SMILES COc1cc(C[C@H]2[C@H](C)CCCC2=C)c(O)cc1Br
Show InChI InChI=1S/C16H21BrO2/c1-10-5-4-6-11(2)13(10)7-12-8-16(19-3)14(17)9-15(12)18/h8-9,11,13,18H,1,4-7H2,2-3H3/t11-,13-/m1/s1
2.29E+3n/an/an/an/an/an/an/an/a
Ligand Pharmaceuticals, Inc.
Curated by ChEMBL
Assay Description
Binding affinity was determined for human glucocorticoid receptor(hGR).
J Med Chem 39: 1778-89 (1996)
Article DOI: 10.1021/jm950747d
BindingDB Entry DOI: 10.7270/Q2416XQ2
Progesterone receptor
(Homo sapiens (Human))
BDBM50049511
(5-Bromo-4-methoxy-2-((1S,2R)-2-methyl-6-methylene-...)
Show SMILES COc1cc(C[C@H]2[C@H](C)CCCC2=C)c(O)cc1Br
Show InChI InChI=1S/C16H21BrO2/c1-10-5-4-6-11(2)13(10)7-12-8-16(19-3)14(17)9-15(12)18/h8-9,11,13,18H,1,4-7H2,2-3H3/t11-,13-/m1/s1
n/an/a 320n/an/an/an/an/an/a
Ligand Pharmaceuticals, Inc.
Curated by ChEMBL
Assay Description
Concentration required to give half-maximal inhibition against human Progesterone receptor B isoform in co-transfected CV-1 cell lines.
J Med Chem 39: 1778-89 (1996)
Article DOI: 10.1021/jm950747d
BindingDB Entry DOI: 10.7270/Q2416XQ2
Progesterone receptor
(Homo sapiens (Human))
BDBM50049511
(5-Bromo-4-methoxy-2-((1S,2R)-2-methyl-6-methylene-...)
Show SMILES COc1cc(C[C@H]2[C@H](C)CCCC2=C)c(O)cc1Br
Show InChI InChI=1S/C16H21BrO2/c1-10-5-4-6-11(2)13(10)7-12-8-16(19-3)14(17)9-15(12)18/h8-9,11,13,18H,1,4-7H2,2-3H3/t11-,13-/m1/s1
n/an/an/an/a 3.01E+3n/an/an/an/a
Ligand Pharmaceuticals, Inc.
Curated by ChEMBL
Assay Description
Effective concentration against human Progesterone receptor B isoform expressed in CV-1 cells
J Med Chem 39: 1778-89 (1996)
Article DOI: 10.1021/jm950747d
BindingDB Entry DOI: 10.7270/Q2416XQ2
Progesterone receptor
(Homo sapiens (Human))
BDBM50049511
(5-Bromo-4-methoxy-2-((1S,2R)-2-methyl-6-methylene-...)
Show SMILES COc1cc(C[C@H]2[C@H](C)CCCC2=C)c(O)cc1Br
Show InChI InChI=1S/C16H21BrO2/c1-10-5-4-6-11(2)13(10)7-12-8-16(19-3)14(17)9-15(12)18/h8-9,11,13,18H,1,4-7H2,2-3H3/t11-,13-/m1/s1
n/an/a 200n/an/an/an/an/an/a
Ligand Pharmaceuticals, Inc.
Curated by ChEMBL
Assay Description
Antagonistic potency to the human progesterone receptor measured in the T-47D alkaline phosphatase assay
J Med Chem 39: 1778-89 (1996)
Article DOI: 10.1021/jm950747d
BindingDB Entry DOI: 10.7270/Q2416XQ2