null
SMILES: Cl.Clc1ccc(cc1)-c1nc2ccc(cc2c2NCCCc12)C(=O)NCCCCNc1c2CCCCc2nc2cc(Cl)ccc12
InChI Key: InChIKey=ZQFXENUXQNLUDE-UHFFFAOYSA-N
Activity Spreadsheet -- Enzyme Inhibition Constant Data from BindingDB
Found 2 hits for monomerid = 50049861
Trg + Lig
Ki
nM
ΔG°
kcal/mole
IC50
nM
Kd
nM
EC50/IC50
nM
koff
s-1
kon
M-1s-1
pHTemp
°C
Acetylcholinesterase
(Homo sapiens (Human))
BDBM50049861
(CHEMBL3322233)
Show SMILES Cl.Clc1ccc(cc1)-c1nc2ccc(cc2c2NCCCc12)C(=O)NCCCCNc1c2CCCCc2nc2cc(Cl)ccc12
Show InChI InChI=1S/C36H35Cl2N5O/c37-24-12-9-22(10-13-24)33-28-7-5-19-40-35(28)29-20-23(11-16-31(29)43-33)36(44)41-18-4-3-17-39-34-26-6-1-2-8-30(26)42-32-21-25(38)14-15-27(32)34/h9-16,20-21,40H,1-8,17-19H2,(H,39,42)(H,41,44)
NCI pathway
Reactome pathway
n/an/a 14n/an/an/an/an/an/a
Universitat de Barcelona
Curated by ChEMBL
Assay Description
Inhibition of human recombinant AChE using acetylthiocholine iodide as substrate by spectrophotometric analysis
Eur J Med Chem 84: 107-17 (2014)
Article DOI: 10.1016/j.ejmech.2014.07.021
BindingDB Entry DOI: 10.7270/Q2571DNF
Cholinesterase
(Homo sapiens (Human))
BDBM50049861
(CHEMBL3322233)
Show SMILES Cl.Clc1ccc(cc1)-c1nc2ccc(cc2c2NCCCc12)C(=O)NCCCCNc1c2CCCCc2nc2cc(Cl)ccc12
Show InChI InChI=1S/C36H35Cl2N5O/c37-24-12-9-22(10-13-24)33-28-7-5-19-40-35(28)29-20-23(11-16-31(29)43-33)36(44)41-18-4-3-17-39-34-26-6-1-2-8-30(26)42-32-21-25(38)14-15-27(32)34/h9-16,20-21,40H,1-8,17-19H2,(H,39,42)(H,41,44)
Reactome pathway
n/an/a 205n/an/an/an/an/an/a
Universitat de Barcelona
Curated by ChEMBL
Assay Description
Inhibition of human recombinant BChE using butyrylthiocholine iodide as substrate by spectrophotometric analysis
Eur J Med Chem 84: 107-17 (2014)
Article DOI: 10.1016/j.ejmech.2014.07.021
BindingDB Entry DOI: 10.7270/Q2571DNF