BDBM50049862 CHEMBL3322232
SMILES: Cl.Clc1ccc(cc1)-c1nc2ccc(cc2c2NCCCc12)C(=O)NCCCNc1c2CCCCc2nc2cc(Cl)ccc12
InChI Key: InChIKey=NOBALTDRZBHVTJ-UHFFFAOYSA-N
Data: 2 IC50
Activity Spreadsheet -- Enzyme Inhibition Constant Data from BindingDB
Found 2 hits for monomerid = 50049862
Trg + Lig
Ki
nM
ΔG°
kcal/mole
IC50
nM
Kd
nM
EC50/IC50
nM
koff
s-1
kon
M-1s-1
pHTemp
°C
Acetylcholinesterase
(Homo sapiens (Human))
BDBM50049862
(CHEMBL3322232)
Show SMILES Cl.Clc1ccc(cc1)-c1nc2ccc(cc2c2NCCCc12)C(=O)NCCCNc1c2CCCCc2nc2cc(Cl)ccc12
Show InChI InChI=1S/C35H33Cl2N5O/c36-23-11-8-21(9-12-23)32-27-6-3-16-38-34(27)28-19-22(10-15-30(28)42-32)35(43)40-18-4-17-39-33-25-5-1-2-7-29(25)41-31-20-24(37)13-14-26(31)33/h8-15,19-20,38H,1-7,16-18H2,(H,39,41)(H,40,43)
NCI pathway
Reactome pathway
n/an/a 0.00600n/an/an/an/an/an/a
Universitat de Barcelona
Curated by ChEMBL
Assay Description
Inhibition of human recombinant AChE using acetylthiocholine iodide as substrate by spectrophotometric analysis
Eur J Med Chem 84: 107-17 (2014)
Article DOI: 10.1016/j.ejmech.2014.07.021
BindingDB Entry DOI: 10.7270/Q2571DNF
Cholinesterases
(Homo sapiens (Human))
BDBM50049862
(CHEMBL3322232)
Show SMILES Cl.Clc1ccc(cc1)-c1nc2ccc(cc2c2NCCCc12)C(=O)NCCCNc1c2CCCCc2nc2cc(Cl)ccc12
Show InChI InChI=1S/C35H33Cl2N5O/c36-23-11-8-21(9-12-23)32-27-6-3-16-38-34(27)28-19-22(10-15-30(28)42-32)35(43)40-18-4-17-39-33-25-5-1-2-7-29(25)41-31-20-24(37)13-14-26(31)33/h8-15,19-20,38H,1-7,16-18H2,(H,39,41)(H,40,43)
Reactome pathway
n/an/a 120n/an/an/an/an/an/a
Universitat de Barcelona
Curated by ChEMBL
Assay Description
Inhibition of human recombinant BChE using butyrylthiocholine iodide as substrate by spectrophotometric analysis
Eur J Med Chem 84: 107-17 (2014)
Article DOI: 10.1016/j.ejmech.2014.07.021
BindingDB Entry DOI: 10.7270/Q2571DNF