BDBM50050514 Boronic acid derivative::CHEMBL304007
SMILES: N[C@@H](Cc1ccc(O)cc1)C(=O)N1CCC[C@H]1B(O)O
InChI Key: InChIKey=LYHLWGWZZIJGKK-RYUDHWBXSA-N
Data: 1 IC50
Activity Spreadsheet -- Enzyme Inhibition Constant Data from BindingDB
Found 1 hit for monomerid = 50050514
Trg + Lig
Ki
nM
ΔG°
kcal/mole
IC50
nM
Kd
nM
EC50/IC50
nM
koff
s-1
kon
M-1s-1
pHTemp
°C
Dipeptidyl peptidase 4
(Homo sapiens (Human))
BDBM50050514
(Boronic acid derivative | CHEMBL304007)
Show SMILES N[C@@H](Cc1ccc(O)cc1)C(=O)N1CCC[C@H]1B(O)O
Show InChI InChI=1S/C13H19BN2O4/c15-11(8-9-3-5-10(17)6-4-9)13(18)16-7-1-2-12(16)14(19)20/h3-6,11-12,17,19-20H,1-2,7-8,15H2/t11-,12-/m0/s1
Reactome pathway
n/an/a 32n/an/an/an/an/an/a
Boehringer Ingelheim Pharmaceuticals Inc.
Curated by ChEMBL
Assay Description
In vitro for inhibition of Dipeptidylpeptidase IV.
J Med Chem 39: 2087-94 (1996)
Article DOI: 10.1021/jm950732f
BindingDB Entry DOI: 10.7270/Q29Z95K5