BDBM50050538 CHEMBL3182091
SMILES: Cc1cccc(c1)C(=O)Nc1cccc(NC(=O)c2cccs2)c1
InChI Key: InChIKey=GRCJLLALFPJSKP-UHFFFAOYSA-N
Data: 2 IC50
Activity Spreadsheet -- Enzyme Inhibition Constant Data from BindingDB
Found 2 hits for monomerid = 50050538
Trg + Lig
Ki
nM
ΔG°
kcal/mole
IC50
nM
Kd
nM
EC50/IC50
nM
koff
s-1
kon
M-1s-1
pHTemp
°C
Potassium channel subfamily K member 9
(Homo sapiens (Human))
BDBM50050538
(CHEMBL3182091)
Show SMILES Cc1cccc(c1)C(=O)Nc1cccc(NC(=O)c2cccs2)c1
Show InChI InChI=1S/C19H16N2O2S/c1-13-5-2-6-14(11-13)18(22)20-15-7-3-8-16(12-15)21-19(23)17-9-4-10-24-17/h2-12H,1H3,(H,20,22)(H,21,23)
Reactome pathway
n/an/a 330n/an/an/an/an/an/a
University of Kansas Specialized Chemistry Center
Curated by ChEMBL
Assay Description
Inhibition of TASK-3 (unknown origin) expressed in CHO cells by thallium flux assay
Bioorg Med Chem Lett 24: 3968-73 (2014)
Article DOI: 10.1016/j.bmcl.2014.06.032
BindingDB Entry DOI: 10.7270/Q2805487
Potassium channel protein TASK-1
(Homo sapiens (Human))
BDBM50050538
(CHEMBL3182091)
Show SMILES Cc1cccc(c1)C(=O)Nc1cccc(NC(=O)c2cccs2)c1
Show InChI InChI=1S/C19H16N2O2S/c1-13-5-2-6-14(11-13)18(22)20-15-7-3-8-16(12-15)21-19(23)17-9-4-10-24-17/h2-12H,1H3,(H,20,22)(H,21,23)
n/an/a 5n/an/an/an/an/an/a
University of Kansas Specialized Chemistry Center
Curated by ChEMBL
Assay Description
Inhibition of TASK-1 (unknown origin) expressed in CHO cells by thallium flux assay
Bioorg Med Chem Lett 24: 3968-73 (2014)
Article DOI: 10.1016/j.bmcl.2014.06.032
BindingDB Entry DOI: 10.7270/Q2805487