BDBM50050551 CHEMBL3317866
SMILES: CCCOc1ccc(C[C@@H](Cc2ccccc2)C(O)=O)cc1CNC(=O)c1ccc(cc1)N1CC2CCC(C2)C1
InChI Key: InChIKey=SOCVTCXYXPQYPF-VMJMFXBVSA-N
Data: 1 Kd  1 EC50
Activity Spreadsheet -- Enzyme Inhibition Constant Data from BindingDB
Found 2 hits for monomerid = 50050551
Trg + Lig
Ki
nM
ΔG°
kcal/mole
IC50
nM
Kd
nM
EC50/IC50
nM
koff
s-1
kon
M-1s-1
pHTemp
°C
Peroxisome proliferator-activated receptor
(Homo sapiens (Human))
BDBM50050551
(CHEMBL3317866)
Show SMILES CCCOc1ccc(C[C@@H](Cc2ccccc2)C(O)=O)cc1CNC(=O)c1ccc(cc1)N1CC2CCC(C2)C1 |r,TLB:29:32:38:35.36|
Show InChI InChI=1S/C34H40N2O4/c1-2-16-40-32-15-10-25(19-29(34(38)39)18-24-6-4-3-5-7-24)20-30(32)21-35-33(37)28-11-13-31(14-12-28)36-22-26-8-9-27(17-26)23-36/h3-7,10-15,20,26-27,29H,2,8-9,16-19,21-23H2,1H3,(H,35,37)(H,38,39)/t26?,27?,29-/m1/s1
NCI pathway
Reactome pathway
n/an/an/an/a 12n/an/an/an/a
Okayama University
Curated by ChEMBL
Assay Description
Agonist activity at human PPARgamma
Bioorg Med Chem Lett 24: 4001-5 (2014)
Article DOI: 10.1016/j.bmcl.2014.06.023
BindingDB Entry DOI: 10.7270/Q20G3MTS
Peroxisome proliferator-activated receptor
(Homo sapiens (Human))
BDBM50050551
(CHEMBL3317866)
Show SMILES CCCOc1ccc(C[C@@H](Cc2ccccc2)C(O)=O)cc1CNC(=O)c1ccc(cc1)N1CC2CCC(C2)C1 |r,TLB:29:32:38:35.36|
Show InChI InChI=1S/C34H40N2O4/c1-2-16-40-32-15-10-25(19-29(34(38)39)18-24-6-4-3-5-7-24)20-30(32)21-35-33(37)28-11-13-31(14-12-28)36-22-26-8-9-27(17-26)23-36/h3-7,10-15,20,26-27,29H,2,8-9,16-19,21-23H2,1H3,(H,35,37)(H,38,39)/t26?,27?,29-/m1/s1
NCI pathway
Reactome pathway
n/an/an/a 0.800n/an/an/an/an/a
Okayama University
Curated by ChEMBL
Assay Description
Binding affinity to human His-tagged PPARgamma LBD by SPR method
Bioorg Med Chem Lett 24: 4001-5 (2014)
Article DOI: 10.1016/j.bmcl.2014.06.023
BindingDB Entry DOI: 10.7270/Q20G3MTS