BDBM50050857 CHEMBL3318031
SMILES: COc1cc(ccc1O)-c1cnc2c(NC(=O)NC(C)(C)C)ccnc2c1
InChI Key: InChIKey=BMYVBFWCLHRHTH-UHFFFAOYSA-N
Data: 2 IC50
Activity Spreadsheet -- Enzyme Inhibition Constant Data from BindingDB
Found 2 hits for monomerid = 50050857
Trg + Lig
Ki
nM
ΔG°
kcal/mole
IC50
nM
Kd
nM
EC50/IC50
nM
koff
s-1
kon
M-1s-1
pHTemp
°C
Aurora kinase B
(Homo sapiens (Human))
BDBM50050857
(CHEMBL3318031)
Show SMILES COc1cc(ccc1O)-c1cnc2c(NC(=O)NC(C)(C)C)ccnc2c1
Show InChI InChI=1S/C20H22N4O3/c1-20(2,3)24-19(26)23-14-7-8-21-15-9-13(11-22-18(14)15)12-5-6-16(25)17(10-12)27-4/h5-11,25H,1-4H3,(H2,21,23,24,26)
Reactome pathway
n/an/a 1.58E+3n/an/an/an/an/an/a
Universit£ de Nantes
Curated by ChEMBL
Assay Description
Inhibition of Aurora B (unknown origin)
Bioorg Med Chem Lett 24: 3748-52 (2014)
Article DOI: 10.1016/j.bmcl.2014.06.078
BindingDB Entry DOI: 10.7270/Q270832Z
Mitogen-activated protein kinase 1
(Homo sapiens (Human))
BDBM50050857
(CHEMBL3318031)
Show SMILES COc1cc(ccc1O)-c1cnc2c(NC(=O)NC(C)(C)C)ccnc2c1
Show InChI InChI=1S/C20H22N4O3/c1-20(2,3)24-19(26)23-14-7-8-21-15-9-13(11-22-18(14)15)12-5-6-16(25)17(10-12)27-4/h5-11,25H,1-4H3,(H2,21,23,24,26)
NCI pathway
Reactome pathway
n/an/a>1.00E+5n/an/an/an/an/an/a
Universit£ de Nantes
Curated by ChEMBL
Assay Description
Inhibition of ERK2 (unknown origin)
Bioorg Med Chem Lett 24: 3748-52 (2014)
Article DOI: 10.1016/j.bmcl.2014.06.078
BindingDB Entry DOI: 10.7270/Q270832Z