BDBM50051070 CHEMBL3318079
SMILES: COc1ccc(Nc2nc(N)n(n2)C(=O)c2cc(OC)c(OC)c(OC)c2)cc1
InChI Key: InChIKey=UXCVPZNUZBTQOO-UHFFFAOYSA-N
Data: 1 IC50
Activity Spreadsheet -- Enzyme Inhibition Constant Data from BindingDB
Found 1 hit for monomerid = 50051070
Trg + Lig
Ki
nM
ΔG°
kcal/mole
IC50
nM
Kd
nM
EC50/IC50
nM
koff
s-1
kon
M-1s-1
pHTemp
°C
Similar to alpha-tubulin isoform 1
(Bos taurus)
BDBM50051070
(CHEMBL3318079)
Show SMILES COc1ccc(Nc2nc(N)n(n2)C(=O)c2cc(OC)c(OC)c(OC)c2)cc1
Show InChI InChI=1S/C19H21N5O5/c1-26-13-7-5-12(6-8-13)21-19-22-18(20)24(23-19)17(25)11-9-14(27-2)16(29-4)15(10-11)28-3/h5-10H,1-4H3,(H3,20,21,22,23)
n/an/a 3.70E+3n/an/an/an/an/an/a
Universit£ di Ferrara
Curated by ChEMBL
Assay Description
Inhibition of bovine brain tubulin polymerization by turbidimetry
J Med Chem 57: 6795-808 (2014)
Article DOI: 10.1021/jm5008193
BindingDB Entry DOI: 10.7270/Q26111Z5