BDBM50051257 CHEMBL545607::N-[4-(4-Benzo[d]isothiazol-3-yl-piperazin-1-yl)-butyl]-N-methyl-benzamide; hydrochloride
SMILES: CN(CCCCN1CCN(CC1)c1nsc2ccccc12)C(=O)c1ccccc1
InChI Key: InChIKey=UNFZXGFODICBBR-UHFFFAOYSA-N
Data: 2 IC50
Activity Spreadsheet -- Enzyme Inhibition Constant Data from BindingDB
Found 2 hits for monomerid = 50051257
Trg + Lig
Ki
nM
ΔG°
kcal/mole
IC50
nM
Kd
nM
EC50/IC50
nM
koff
s-1
kon
M-1s-1
pHTemp
°C
D(2) dopamine receptor
(Rattus norvegicus (rat))
BDBM50051257
(CHEMBL545607 | N-[4-(4-Benzo[d]isothiazol-3-yl-pip...)
Show SMILES CN(CCCCN1CCN(CC1)c1nsc2ccccc12)C(=O)c1ccccc1
Show InChI InChI=1S/C23H28N4OS/c1-25(23(28)19-9-3-2-4-10-19)13-7-8-14-26-15-17-27(18-16-26)22-20-11-5-6-12-21(20)29-24-22/h2-6,9-12H,7-8,13-18H2,1H3
Reactome pathway
n/an/a 17n/an/an/an/an/an/a
Glaxo Wellcome Inc.
Curated by ChEMBL
Assay Description
In vitro inhibitory activity against [3H]raclopride binding to dopamine receptor D2
J Med Chem 39: 1172-88 (1996)
Article DOI: 10.1021/jm950551d
BindingDB Entry DOI: 10.7270/Q2SQ912Q
5-hydroxytryptamine receptor 1A
(Rattus norvegicus (rat))
BDBM50051257
(CHEMBL545607 | N-[4-(4-Benzo[d]isothiazol-3-yl-pip...)
Show SMILES CN(CCCCN1CCN(CC1)c1nsc2ccccc12)C(=O)c1ccccc1
Show InChI InChI=1S/C23H28N4OS/c1-25(23(28)19-9-3-2-4-10-19)13-7-8-14-26-15-17-27(18-16-26)22-20-11-5-6-12-21(20)29-24-22/h2-6,9-12H,7-8,13-18H2,1H3
n/an/a 1.40n/an/an/an/an/an/a
Glaxo Wellcome Inc.
Curated by ChEMBL
Assay Description
In vitro inhibitory activity against [3H]8-OH-DPAT binding to 5-hydroxytryptamine 1A receptor
J Med Chem 39: 1172-88 (1996)
Article DOI: 10.1021/jm950551d
BindingDB Entry DOI: 10.7270/Q2SQ912Q