BDBM50051711 2-Butylsulfanyl-1,9-dihydro-purin-6-one::CHEMBL84609
SMILES: CCCCSc1nc2nc[nH]c2c(=O)[nH]1
InChI Key: InChIKey=WXZZQXYAWULBOZ-UHFFFAOYSA-N
Data: 1 KI  1 IC50
Activity Spreadsheet -- Enzyme Inhibition Constant Data from BindingDB
Found 2 hits for monomerid = 50051711
Trg + Lig
Ki
nM
ΔG°
kcal/mole
IC50
nM
Kd
nM
EC50/IC50
nM
koff
s-1
kon
M-1s-1
pHTemp
°C
Xanthine dehydrogenase/oxidase
(Homo sapiens (Human))
BDBM50051711
(2-Butylsulfanyl-1,9-dihydro-purin-6-one | CHEMBL84...)
Show SMILES CCCCSc1nc2nc[nH]c2c(=O)[nH]1
Show InChI InChI=1S/C9H12N4OS/c1-2-3-4-15-9-12-7-6(8(14)13-9)10-5-11-7/h5H,2-4H2,1H3,(H2,10,11,12,13,14)
176n/an/an/an/an/an/an/an/a
Università di Modena
Curated by ChEMBL
Assay Description
Inhibitory activity against Xanthine Oxidase
J Med Chem 39: 2529-35 (1996)
Article DOI: 10.1021/jm950876u
BindingDB Entry DOI: 10.7270/Q23R0RZS
Xanthine dehydrogenase/oxidase
(Homo sapiens (Human))
BDBM50051711
(2-Butylsulfanyl-1,9-dihydro-purin-6-one | CHEMBL84...)
Show SMILES CCCCSc1nc2nc[nH]c2c(=O)[nH]1
Show InChI InChI=1S/C9H12N4OS/c1-2-3-4-15-9-12-7-6(8(14)13-9)10-5-11-7/h5H,2-4H2,1H3,(H2,10,11,12,13,14)
n/an/a 3.88E+3n/an/an/an/an/an/a
Università di Modena
Curated by ChEMBL
Assay Description
Inhibitory activity against Xanthine Oxidase
J Med Chem 39: 2529-35 (1996)
Article DOI: 10.1021/jm950876u
BindingDB Entry DOI: 10.7270/Q23R0RZS