BDBM50051824 CHEMBL283208::[(S)-4-((R)-2-Amino-3-mercapto-propyl)-3-butyl-piperazin-1-yl]-(2,3-dimethyl-phenyl)-methanone
SMILES: CCCC[C@H]1CN(CCN1C[C@@H](N)CS)C(=O)c1cccc(C)c1C
InChI Key: InChIKey=IWQXXMWFEZGUPJ-MSOLQXFVSA-N
Data: 2 IC50
Activity Spreadsheet -- Enzyme Inhibition Constant Data from BindingDB
Found 2 hits for monomerid = 50051824
Trg + Lig
Ki
nM
ΔG°
kcal/mole
IC50
nM
Kd
nM
EC50/IC50
nM
koff
s-1
kon
M-1s-1
pHTemp
°C
Protein Farnesyltransferase (PFT) Chain B
(Homo sapiens (Human))
BDBM50051824
(CHEMBL283208 | [(S)-4-((R)-2-Amino-3-mercapto-prop...)
Show SMILES CCCC[C@H]1CN(CCN1C[C@@H](N)CS)C(=O)c1cccc(C)c1C
Show InChI InChI=1S/C20H33N3OS/c1-4-5-8-18-13-23(11-10-22(18)12-17(21)14-25)20(24)19-9-6-7-15(2)16(19)3/h6-7,9,17-18,25H,4-5,8,10-14,21H2,1-3H3/t17-,18+/m1/s1
n/an/a 5n/an/an/an/an/an/a
Merck Research Laboratories
Curated by ChEMBL
Assay Description
Inhibition of [3H]-FPP incorporation into Ha-Ras by Farnesyltransferase
J Med Chem 39: 1345-8 (1996)
Article DOI: 10.1021/jm9508090
BindingDB Entry DOI: 10.7270/Q2B8576Z
Geranylgeranyl Transferase (GGTase-I)
(Bos taurus (bovine))
BDBM50051824
(CHEMBL283208 | [(S)-4-((R)-2-Amino-3-mercapto-prop...)
Show SMILES CCCC[C@H]1CN(CCN1C[C@@H](N)CS)C(=O)c1cccc(C)c1C
Show InChI InChI=1S/C20H33N3OS/c1-4-5-8-18-13-23(11-10-22(18)12-17(21)14-25)20(24)19-9-6-7-15(2)16(19)3/h6-7,9,17-18,25H,4-5,8,10-14,21H2,1-3H3/t17-,18+/m1/s1
n/an/a 360n/an/an/an/an/an/a
Merck Research Laboratories
Curated by ChEMBL
Assay Description
Inhibition of bovine Geranylgeranyl transferase type I
J Med Chem 39: 1345-8 (1996)
Article DOI: 10.1021/jm9508090
BindingDB Entry DOI: 10.7270/Q2B8576Z