BDBM50052060 5-Phenyl-6-oxa-12b-aza-naphtho[2,3-e]azulen-4-one::CHEMBL314882
SMILES: O=C1C(Oc2cc3ccccc3cc2-n2cccc12)c1ccccc1
InChI Key: InChIKey=QKIVMUINKRSFES-UHFFFAOYSA-N
Data: 1 IC50
Activity Spreadsheet -- Enzyme Inhibition Constant Data from BindingDB
Found 1 hit for monomerid = 50052060
Trg + Lig
Ki
nM
ΔG°
kcal/mole
IC50
nM
Kd
nM
EC50/IC50
nM
koff
s-1
kon
M-1s-1
pHTemp
°C
Human immunodeficiency virus type 1 reverse transcriptase
(Human immunodeficiency virus 1)
BDBM50052060
(5-Phenyl-6-oxa-12b-aza-naphtho[2,3-e]azulen-4-one ...)
Show SMILES O=C1C(Oc2cc3ccccc3cc2-n2cccc12)c1ccccc1
Show InChI InChI=1S/C22H15NO2/c24-21-18-11-6-12-23(18)19-13-16-9-4-5-10-17(16)14-20(19)25-22(21)15-7-2-1-3-8-15/h1-14,22H
n/an/a>3.00E+5n/an/an/an/an/an/a
Universitá di Siena
Curated by ChEMBL
Assay Description
Compound was tested for Inhibition of HIV-1 RT activity.
J Med Chem 39: 2672-80 (1996)
Article DOI: 10.1021/jm950702c
BindingDB Entry DOI: 10.7270/Q21R6PM4