BDBM50052066 CHEMBL3322585
SMILES: O=C(Nc1ccc2\C(=C\c3ccc[nH]3)C(=O)Nc2c1)c1c[nH]cc(-c2ccccc2)c1=O
InChI Key: InChIKey=CACUYAFFURLWME-ODLFYWEKSA-N
Data: 1 IC50
Activity Spreadsheet -- Enzyme Inhibition Constant Data from BindingDB
Found 1 hit for monomerid = 50052066
Trg + Lig
Ki
nM
ΔG°
kcal/mole
IC50
nM
Kd
nM
EC50/IC50
nM
koff
s-1
kon
M-1s-1
pHTemp
°C
Aurora kinase B
(Homo sapiens (Human))
BDBM50052066
(CHEMBL3322585)
Show SMILES O=C(Nc1ccc2\C(=C\c3ccc[nH]3)C(=O)Nc2c1)c1c[nH]cc(-c2ccccc2)c1=O
Show InChI InChI=1S/C25H18N4O3/c30-23-20(15-5-2-1-3-6-15)13-26-14-21(23)25(32)28-17-8-9-18-19(11-16-7-4-10-27-16)24(31)29-22(18)12-17/h1-14,27H,(H,26,30)(H,28,32)(H,29,31)/b19-11-
Reactome pathway
n/an/a 33n/an/an/an/an/an/a
National Taiwan University
Curated by ChEMBL
Assay Description
Inhibition of Aurora B (unknown origin) using H-LRRASLG substrate by radioisotope-based P81 filter-binding assay
Eur J Med Chem 84: 312-34 (2014)
Article DOI: 10.1016/j.ejmech.2014.07.033
BindingDB Entry DOI: 10.7270/Q2RV0QB7