BDBM50052068 CHEMBL3322587
SMILES: Clc1ccc(cc1)-c1c[nH]cc(C(=O)Nc2ccc3\C(=C\c4ccc[nH]4)C(=O)Nc3c2)c1=O
InChI Key: InChIKey=GFIYQNNOGFHAOF-GRSHGNNSSA-N
Data: 1 IC50
Activity Spreadsheet -- Enzyme Inhibition Constant Data from BindingDB
Found 1 hit for monomerid = 50052068
Trg + Lig
Ki
nM
ΔG°
kcal/mole
IC50
nM
Kd
nM
EC50/IC50
nM
koff
s-1
kon
M-1s-1
pHTemp
°C
Aurora kinase B
(Homo sapiens (Human))
BDBM50052068
(CHEMBL3322587)
Show SMILES Clc1ccc(cc1)-c1c[nH]cc(C(=O)Nc2ccc3\C(=C\c4ccc[nH]4)C(=O)Nc3c2)c1=O
Show InChI InChI=1S/C25H17ClN4O3/c26-15-5-3-14(4-6-15)20-12-27-13-21(23(20)31)25(33)29-17-7-8-18-19(10-16-2-1-9-28-16)24(32)30-22(18)11-17/h1-13,28H,(H,27,31)(H,29,33)(H,30,32)/b19-10-
Reactome pathway
n/an/a 54n/an/an/an/an/an/a
National Taiwan University
Curated by ChEMBL
Assay Description
Inhibition of Aurora B (unknown origin) using H-LRRASLG substrate by radioisotope-based P81 filter-binding assay
Eur J Med Chem 84: 312-34 (2014)
Article DOI: 10.1016/j.ejmech.2014.07.033
BindingDB Entry DOI: 10.7270/Q2RV0QB7