BDBM50052090 6,7-Dimethoxy-9-(3,4,5-trimethoxy-phenyl)-3H-naphtho[2,3-c]furan-1-one::CHEMBL284006
SMILES: COc1cc(cc(OC)c1OC)-c1c2C(=O)OCc2cc2cc(OC)c(OC)cc12
InChI Key: InChIKey=VFULRIWYLLHLAZ-UHFFFAOYSA-N
Data: 4 IC50
Activity Spreadsheet -- Enzyme Inhibition Constant Data from BindingDB
Found 4 hits for monomerid = 50052090
Trg + Lig
Ki
nM
ΔG°
kcal/mole
IC50
nM
Kd
nM
EC50/IC50
nM
koff
s-1
kon
M-1s-1
pHTemp
°C
cGMP-specific 3',5'-cyclic phosphodiesterase
(Homo sapiens (Human))
BDBM50052090
(6,7-Dimethoxy-9-(3,4,5-trimethoxy-phenyl)-3H-napht...)
Show SMILES COc1cc(cc(OC)c1OC)-c1c2C(=O)OCc2cc2cc(OC)c(OC)cc12
Show InChI InChI=1S/C23H22O7/c1-25-16-7-12-6-14-11-30-23(24)21(14)20(15(12)10-17(16)26-2)13-8-18(27-3)22(29-5)19(9-13)28-4/h6-10H,11H2,1-5H3
Reactome pathway
n/an/a 1.00E+3n/an/an/an/an/an/a
Tan£be Seiyaku Company, Ltd.
Curated by ChEMBL
Assay Description
Inhibition in vitro of Phosphodiesterase 5 isolated from guinea pig lung
J Med Chem 39: 2696-704 (1996)
Article DOI: 10.1021/jm9509096
BindingDB Entry DOI: 10.7270/Q2WS8TW7
Phosphodiesterase 3
(Homo sapiens (Human))
BDBM50052090
(6,7-Dimethoxy-9-(3,4,5-trimethoxy-phenyl)-3H-napht...)
Show SMILES COc1cc(cc(OC)c1OC)-c1c2C(=O)OCc2cc2cc(OC)c(OC)cc12
Show InChI InChI=1S/C23H22O7/c1-25-16-7-12-6-14-11-30-23(24)21(14)20(15(12)10-17(16)26-2)13-8-18(27-3)22(29-5)19(9-13)28-4/h6-10H,11H2,1-5H3
n/an/a 320n/an/an/an/an/an/a
Tanabe Seiyaku Company, Ltd.
Curated by ChEMBL
Assay Description
Inhibitory activity against phosphodiesterase 3 (PDE 3) isolated from cardiac ventricle
J Med Chem 42: 1293-305 (1999)
Article DOI: 10.1021/jm9807048
BindingDB Entry DOI: 10.7270/Q27P8XKH
Phosphodiesterase 1
(Homo sapiens (Human))
BDBM50052090
(6,7-Dimethoxy-9-(3,4,5-trimethoxy-phenyl)-3H-napht...)
Show SMILES COc1cc(cc(OC)c1OC)-c1c2C(=O)OCc2cc2cc(OC)c(OC)cc12
Show InChI InChI=1S/C23H22O7/c1-25-16-7-12-6-14-11-30-23(24)21(14)20(15(12)10-17(16)26-2)13-8-18(27-3)22(29-5)19(9-13)28-4/h6-10H,11H2,1-5H3
n/an/a 820n/an/an/an/an/an/a
Tanabe Seiyaku Company, Ltd.
Curated by ChEMBL
Assay Description
Inhibitory activity against phosphodiesterase 1 (PDE I), isolated from cardiac ventricle
J Med Chem 42: 1293-305 (1999)
Article DOI: 10.1021/jm9807048
BindingDB Entry DOI: 10.7270/Q27P8XKH
cGMP-specific 3',5'-cyclic phosphodiesterase
(Canis lupus familiaris)
BDBM50052090
(6,7-Dimethoxy-9-(3,4,5-trimethoxy-phenyl)-3H-napht...)
Show SMILES COc1cc(cc(OC)c1OC)-c1c2C(=O)OCc2cc2cc(OC)c(OC)cc12
Show InChI InChI=1S/C23H22O7/c1-25-16-7-12-6-14-11-30-23(24)21(14)20(15(12)10-17(16)26-2)13-8-18(27-3)22(29-5)19(9-13)28-4/h6-10H,11H2,1-5H3
Reactome pathway
n/an/a 5.70E+3n/an/an/an/an/an/a
Tanabe Seiyaku Company, Ltd.
Curated by ChEMBL
Assay Description
Inhibitory activity against phosphodiesterase 5 (PDE V), isolated from cardiac ventricle
J Med Chem 42: 1293-305 (1999)
Article DOI: 10.1021/jm9807048
BindingDB Entry DOI: 10.7270/Q27P8XKH