BDBM50052342 3-(2-Biphenyl-4-yl-ethyl)-1-aza-bicyclo[2.2.2]octane::CHEMBL322868
SMILES: C(Cc1ccc(cc1)-c1ccccc1)C1CN2CCC1CC2
InChI Key: InChIKey=DZTCLALNSKOSGM-UHFFFAOYSA-N
Data: 1 IC50
Activity Spreadsheet -- Enzyme Inhibition Constant Data from BindingDB
Found 1 hit for monomerid = 50052342
Trg + Lig
Ki
nM
ΔG°
kcal/mole
IC50
nM
Kd
nM
EC50/IC50
nM
koff
s-1
kon
M-1s-1
pHTemp
°C
Squalene synthetase
(Rattus norvegicus)
BDBM50052342
(3-(2-Biphenyl-4-yl-ethyl)-1-aza-bicyclo[2.2.2]octa...)
Show SMILES C(Cc1ccc(cc1)-c1ccccc1)C1CN2CCC1CC2 |TLB:0:14:20.21:18.17,(13.67,-10.95,;15.1,-11.51,;16.32,-10.57,;16.07,-9.06,;17.28,-8.09,;18.72,-8.65,;18.93,-10.18,;17.74,-11.15,;19.93,-7.7,;19.68,-6.18,;20.88,-5.23,;22.31,-5.78,;22.55,-7.32,;21.33,-8.27,;12.48,-11.91,;12.76,-13.42,;11.29,-12.73,;11.57,-10.67,;11.01,-9.42,;11.01,-11.26,;9.42,-11.96,;9.63,-13.46,)|
Show InChI InChI=1S/C21H25N/c1-2-4-18(5-3-1)19-9-6-17(7-10-19)8-11-21-16-22-14-12-20(21)13-15-22/h1-7,9-10,20-21H,8,11-16H2
Reactome pathway
n/an/a 5n/an/an/an/an/an/a
Zeneca Pharmaceuticals
Curated by ChEMBL
Assay Description
In vitro inhibition against rat microsomal squalene synthase (SS)
J Med Chem 39: 2971-9 (1996)
Article DOI: 10.1021/jm950907l
BindingDB Entry DOI: 10.7270/Q24J0D7G