BDBM50052353 3-(4-Benzothiazol-2-yl-phenyl)-1-aza-bicyclo[2.2.2]octan-3-ol::CHEMBL100506
SMILES: OC1(CN2CCC1CC2)c1ccc(cc1)-c1nc2ccccc2s1
InChI Key: InChIKey=PKDJSXUFSNOCDM-UHFFFAOYSA-N
Data: 1 IC50
Activity Spreadsheet -- Enzyme Inhibition Constant Data from BindingDB
Found 1 hit for monomerid = 50052353
Trg + Lig
Ki
nM
ΔG°
kcal/mole
IC50
nM
Kd
nM
EC50/IC50
nM
koff
s-1
kon
M-1s-1
pHTemp
°C
Squalene synthetase
(Rattus norvegicus)
BDBM50052353
(3-(4-Benzothiazol-2-yl-phenyl)-1-aza-bicyclo[2.2.2...)
Show SMILES OC1(CN2CCC1CC2)c1ccc(cc1)-c1nc2ccccc2s1 |THB:0:1:5.4:7.8,9:1:5.4:7.8,(12.16,-7.72,;11.82,-9.91,;12.13,-11.4,;10.64,-10.73,;9,-11.44,;8.79,-9.95,;10.36,-9.25,;10.36,-7.42,;10.92,-8.69,;13.36,-9.94,;14.12,-8.6,;15.65,-8.6,;16.42,-9.94,;15.66,-11.25,;14.12,-11.25,;17.94,-9.91,;18.81,-8.49,;20.29,-9.14,;21.61,-8.35,;22.96,-9.12,;22.96,-10.67,;21.64,-11.44,;20.3,-10.67,;18.84,-11.18,)|
Show InChI InChI=1S/C20H20N2OS/c23-20(13-22-11-9-16(20)10-12-22)15-7-5-14(6-8-15)19-21-17-3-1-2-4-18(17)24-19/h1-8,16,23H,9-13H2
Reactome pathway
n/an/a 6n/an/an/an/an/an/a
Zeneca Pharmaceuticals
Curated by ChEMBL
Assay Description
In vitro inhibition against rat microsomal squalene synthase (SS)
J Med Chem 39: 2971-9 (1996)
Article DOI: 10.1021/jm950907l
BindingDB Entry DOI: 10.7270/Q24J0D7G