BDBM50052410 9-Amino-1,2,3,4-tetrahydro-acridin-4-ol::CHEMBL319451
SMILES: Nc1c2CCCC(O)c2nc2ccccc12
InChI Key: InChIKey=BISIFJGUTDFVFR-UHFFFAOYSA-N
Data: 4 IC50
Activity Spreadsheet -- Enzyme Inhibition Constant Data from BindingDB
Found 4 hits for monomerid = 50052410
Trg + Lig
Ki
nM
ΔG°
kcal/mole
IC50
nM
Kd
nM
EC50/IC50
nM
koff
s-1
kon
M-1s-1
pHTemp
°C
Acetylcholinesterase
(Homo sapiens (Human))
BDBM50052410
(9-Amino-1,2,3,4-tetrahydro-acridin-4-ol | CHEMBL31...)
Show SMILES Nc1c2CCCC(O)c2nc2ccccc12
Show InChI InChI=1S/C13H14N2O/c14-12-8-4-1-2-6-10(8)15-13-9(12)5-3-7-11(13)16/h1-2,4,6,11,16H,3,5,7H2,(H2,14,15)
NCI pathway
Reactome pathway
n/an/a 476n/an/an/an/an/an/a
Warner-Lambert Company
Curated by ChEMBL
Assay Description
Inhibition of Acetylcholinesterase in monkey red blood cell
J Med Chem 39: 3014-8 (1996)
Article DOI: 10.1021/jm9602266
BindingDB Entry DOI: 10.7270/Q20V8BVM
Acetylcholinesterase
(Rattus norvegicus (rat))
BDBM50052410
(9-Amino-1,2,3,4-tetrahydro-acridin-4-ol | CHEMBL31...)
Show SMILES Nc1c2CCCC(O)c2nc2ccccc12
Show InChI InChI=1S/C13H14N2O/c14-12-8-4-1-2-6-10(8)15-13-9(12)5-3-7-11(13)16/h1-2,4,6,11,16H,3,5,7H2,(H2,14,15)
n/an/a 411n/an/an/an/an/an/a
Warner-Lambert Company
Curated by ChEMBL
Assay Description
Inhibition of Acetylcholinesterase in rat red blood cell
J Med Chem 39: 3014-8 (1996)
Article DOI: 10.1021/jm9602266
BindingDB Entry DOI: 10.7270/Q20V8BVM
Acetylcholinesterase
(Homo sapiens (Human))
BDBM50052410
(9-Amino-1,2,3,4-tetrahydro-acridin-4-ol | CHEMBL31...)
Show SMILES Nc1c2CCCC(O)c2nc2ccccc12
Show InChI InChI=1S/C13H14N2O/c14-12-8-4-1-2-6-10(8)15-13-9(12)5-3-7-11(13)16/h1-2,4,6,11,16H,3,5,7H2,(H2,14,15)
NCI pathway
Reactome pathway
n/an/a 521n/an/an/an/an/an/a
Warner-Lambert Company
Curated by ChEMBL
Assay Description
Inhibition of Acetylcholinesterase in human red blood cell
J Med Chem 39: 3014-8 (1996)
Article DOI: 10.1021/jm9602266
BindingDB Entry DOI: 10.7270/Q20V8BVM
Acetylcholinesterase
(Mus musculus (mouse))
BDBM50052410
(9-Amino-1,2,3,4-tetrahydro-acridin-4-ol | CHEMBL31...)
Show SMILES Nc1c2CCCC(O)c2nc2ccccc12
Show InChI InChI=1S/C13H14N2O/c14-12-8-4-1-2-6-10(8)15-13-9(12)5-3-7-11(13)16/h1-2,4,6,11,16H,3,5,7H2,(H2,14,15)
Reactome pathway
n/an/a 1.43E+3n/an/an/an/an/an/a
Warner-Lambert Company
Curated by ChEMBL
Assay Description
Inhibition of Acetylcholinesterase in mouse red blood cell
J Med Chem 39: 3014-8 (1996)
Article DOI: 10.1021/jm9602266
BindingDB Entry DOI: 10.7270/Q20V8BVM