BDBM50052462 10-(2-Amino-phenylsulfanyl)-1,8-dihydroxy-10H-anthracen-9-one::CHEMBL319696
SMILES: Nc1ccccc1SC1c2cccc(O)c2C(=O)c2c(O)cccc12
InChI Key: InChIKey=KCHPRNPGRGELBS-UHFFFAOYSA-N
Data: 2 IC50
Activity Spreadsheet -- Enzyme Inhibition Constant Data from BindingDB
Found 2 hits for monomerid = 50052462
Trg + Lig
Ki
nM
ΔG°
kcal/mole
IC50
nM
Kd
nM
EC50/IC50
nM
koff
s-1
kon
M-1s-1
pHTemp
°C
Arachidonate 12-lipoxygenase
(Mus musculus)
BDBM50052462
(10-(2-Amino-phenylsulfanyl)-1,8-dihydroxy-10H-anth...)
Show SMILES Nc1ccccc1SC1c2cccc(O)c2C(=O)c2c(O)cccc12
Show InChI InChI=1S/C20H15NO3S/c21-13-7-1-2-10-16(13)25-20-11-5-3-8-14(22)17(11)19(24)18-12(20)6-4-9-15(18)23/h1-10,20,22-23H,21H2
Reactome pathway
n/an/a 6.00E+3n/an/an/an/an/an/a
Universität Regensburg
Curated by ChEMBL
Assay Description
Tested for inhibition of 12-LO (12-lipoxygenase) as an inhibitor of 12(S)-HETE biosynthesis in mouse epidermal homogenates
J Med Chem 39: 3132-8 (1996)
Article DOI: 10.1021/jm960259l
BindingDB Entry DOI: 10.7270/Q2MK6BZ1
Arachidonate 5-lipoxygenase
(Bos taurus)
BDBM50052462
(10-(2-Amino-phenylsulfanyl)-1,8-dihydroxy-10H-anth...)
Show SMILES Nc1ccccc1SC1c2cccc(O)c2C(=O)c2c(O)cccc12
Show InChI InChI=1S/C20H15NO3S/c21-13-7-1-2-10-16(13)25-20-11-5-3-8-14(22)17(11)19(24)18-12(20)6-4-9-15(18)23/h1-10,20,22-23H,21H2
Reactome pathway
n/an/a 2.00E+3n/an/an/an/an/an/a
Universität Regensburg
Curated by ChEMBL
Assay Description
Tested for inhibition of 5-lipoxygenase as inhibition of 5-HETE and LTB4 biosynthesis in bovine PMNL
J Med Chem 39: 3132-8 (1996)
Article DOI: 10.1021/jm960259l
BindingDB Entry DOI: 10.7270/Q2MK6BZ1