BDBM50053225 CHEMBL3318783
SMILES: CC(C)(C)[C@@H](CS(=O)(=O)N1CCS(=O)(=O)CC1)N1[C@@H]([C@H](C[C@](C)(CC(O)=O)C1=O)c1cccc(Cl)c1)c1ccc(Cl)cc1
InChI Key: InChIKey=HJZHRQQVQYCWOF-QNYAKKFESA-N
Data: 1 IC50
Activity Spreadsheet -- Enzyme Inhibition Constant Data from BindingDB
Found 1 hit for monomerid = 50053225
Trg + Lig
Ki
nM
ΔG°
kcal/mole
IC50
nM
Kd
nM
EC50/IC50
nM
koff
s-1
kon
M-1s-1
pHTemp
°C
MDM2-MDMX
(Homo sapiens (Human))
BDBM50053225
(CHEMBL3318783)
Show SMILES CC(C)(C)[C@@H](CS(=O)(=O)N1CCS(=O)(=O)CC1)N1[C@@H]([C@H](C[C@](C)(CC(O)=O)C1=O)c1cccc(Cl)c1)c1ccc(Cl)cc1 |r|
Show InChI InChI=1S/C30H38Cl2N2O7S2/c1-29(2,3)25(19-43(40,41)33-12-14-42(38,39)15-13-33)34-27(20-8-10-22(31)11-9-20)24(21-6-5-7-23(32)16-21)17-30(4,28(34)37)18-26(35)36/h5-11,16,24-25,27H,12-15,17-19H2,1-4H3,(H,35,36)/t24-,25-,27-,30-/m1/s1
NCI pathway
Reactome pathway
n/an/a 0.0590n/an/an/an/an/an/a
Amgen Inc.
Curated by ChEMBL
Assay Description
Binding affinity to human GST-thrombin-tagged MDM2 assessed as inhibition of interaction with human p53 after 1 hr by HTRF assay in presence of 15% h...
Bioorg Med Chem Lett 24: 3782-5 (2014)
Article DOI: 10.1016/j.bmcl.2014.06.073
BindingDB Entry DOI: 10.7270/Q2ZC84HH