BDBM50053228 CHEMBL3318786
SMILES: CC(C)(C)[C@@H](CS(=O)(=O)N1CC(C)(C)c2ccccc12)N1[C@@H]([C@H](C[C@](C)(CC(O)=O)C1=O)c1cccc(Cl)c1)c1ccc(Cl)cc1
InChI Key: InChIKey=NDQXOCTZQJAXLF-PJJBFEFNSA-N
Data: 1 IC50
Activity Spreadsheet -- Enzyme Inhibition Constant Data from BindingDB
Found 1 hit for monomerid = 50053228
Trg + Lig
Ki
nM
ΔG°
kcal/mole
IC50
nM
Kd
nM
EC50/IC50
nM
koff
s-1
kon
M-1s-1
pHTemp
°C
MDM2-MDMX
(Homo sapiens (Human))
BDBM50053228
(CHEMBL3318786)
Show SMILES CC(C)(C)[C@@H](CS(=O)(=O)N1CC(C)(C)c2ccccc12)N1[C@@H]([C@H](C[C@](C)(CC(O)=O)C1=O)c1cccc(Cl)c1)c1ccc(Cl)cc1 |r|
Show InChI InChI=1S/C36H42Cl2N2O5S/c1-34(2,3)30(21-46(44,45)39-22-35(4,5)28-12-7-8-13-29(28)39)40-32(23-14-16-25(37)17-15-23)27(24-10-9-11-26(38)18-24)19-36(6,33(40)43)20-31(41)42/h7-18,27,30,32H,19-22H2,1-6H3,(H,41,42)/t27-,30-,32-,36-/m1/s1
NCI pathway
Reactome pathway
n/an/a 0.120n/an/an/an/an/an/a
Amgen Inc.
Curated by ChEMBL
Assay Description
Binding affinity to human GST-thrombin-tagged MDM2 assessed as inhibition of interaction with human p53 after 1 hr by HTRF assay in presence of 15% h...
Bioorg Med Chem Lett 24: 3782-5 (2014)
Article DOI: 10.1016/j.bmcl.2014.06.073
BindingDB Entry DOI: 10.7270/Q2ZC84HH