BDBM50053244 CHEMBL3330147
SMILES: O=c1[nH]c2sccc2c(N2CCOCC2)c1-c1nc2ccccc2[nH]1
InChI Key: InChIKey=REAARKJSKYURDJ-UHFFFAOYSA-N
Data: 1 IC50
Activity Spreadsheet -- Enzyme Inhibition Constant Data from BindingDB
Found 1 hit for monomerid = 50053244
Trg + Lig
Ki
nM
ΔG°
kcal/mole
IC50
nM
Kd
nM
EC50/IC50
nM
koff
s-1
kon
M-1s-1
pHTemp
°C
Serine/threonine-protein kinase Chk1
(Homo sapiens (Human))
BDBM50053244
(CHEMBL3330147)
Show SMILES O=c1[nH]c2sccc2c(N2CCOCC2)c1-c1nc2ccccc2[nH]1
Show InChI InChI=1S/C18H16N4O2S/c23-17-14(16-19-12-3-1-2-4-13(12)20-16)15(22-6-8-24-9-7-22)11-5-10-25-18(11)21-17/h1-5,10H,6-9H2,(H,19,20)(H,21,23)
Reactome pathway
n/an/a>1.00E+4n/an/an/an/an/an/a
Zhejiang University
Curated by ChEMBL
Assay Description
Inhibition of Chk1 (unknown origin) by luminescent ADP-Glo assay
Bioorg Med Chem 22: 4882-92 (2014)
Article DOI: 10.1016/j.bmc.2014.06.044
BindingDB Entry DOI: 10.7270/Q2TM7CRB