BDBM50053255 CHEMBL3330137
SMILES: O=c1[nH]c2sccc2c(NC2CCCCC2)c1-c1nc2ccccc2[nH]1
InChI Key: InChIKey=BUQVVDYITJQVHY-UHFFFAOYSA-N
Data: 1 IC50
Activity Spreadsheet -- Enzyme Inhibition Constant Data from BindingDB
Found 1 hit for monomerid = 50053255
Trg + Lig
Ki
nM
ΔG°
kcal/mole
IC50
nM
Kd
nM
EC50/IC50
nM
koff
s-1
kon
M-1s-1
pHTemp
°C
Serine/threonine-protein kinase Chk1
(Homo sapiens (Human))
BDBM50053255
(CHEMBL3330137)
Show SMILES O=c1[nH]c2sccc2c(NC2CCCCC2)c1-c1nc2ccccc2[nH]1
Show InChI InChI=1S/C20H20N4OS/c25-19-16(18-22-14-8-4-5-9-15(14)23-18)17(13-10-11-26-20(13)24-19)21-12-6-2-1-3-7-12/h4-5,8-12H,1-3,6-7H2,(H,22,23)(H2,21,24,25)
Reactome pathway
n/an/a>1.00E+4n/an/an/an/an/an/a
Zhejiang University
Curated by ChEMBL
Assay Description
Inhibition of Chk1 (unknown origin) by luminescent ADP-Glo assay
Bioorg Med Chem 22: 4882-92 (2014)
Article DOI: 10.1016/j.bmc.2014.06.044
BindingDB Entry DOI: 10.7270/Q2TM7CRB