BDBM50053258 CHEMBL3330134
SMILES: O=c1[nH]c2sccc2c(NC2CCNC2)c1-c1nc2ccccc2[nH]1
InChI Key: InChIKey=YGJNBROANRKOFK-UHFFFAOYSA-N
Data: 1 IC50
Activity Spreadsheet -- Enzyme Inhibition Constant Data from BindingDB
Found 1 hit for monomerid = 50053258
Trg + Lig
Ki
nM
ΔG°
kcal/mole
IC50
nM
Kd
nM
EC50/IC50
nM
koff
s-1
kon
M-1s-1
pHTemp
°C
Serine/threonine-protein kinase Chk1
(Homo sapiens (Human))
BDBM50053258
(CHEMBL3330134)
Show SMILES O=c1[nH]c2sccc2c(NC2CCNC2)c1-c1nc2ccccc2[nH]1
Show InChI InChI=1S/C18H17N5OS/c24-17-14(16-21-12-3-1-2-4-13(12)22-16)15(20-10-5-7-19-9-10)11-6-8-25-18(11)23-17/h1-4,6,8,10,19H,5,7,9H2,(H,21,22)(H2,20,23,24)
Reactome pathway
n/an/a 48n/an/an/an/an/an/a
Zhejiang University
Curated by ChEMBL
Assay Description
Inhibition of Chk1 (unknown origin) by luminescent ADP-Glo assay
Bioorg Med Chem 22: 4882-92 (2014)
Article DOI: 10.1016/j.bmc.2014.06.044
BindingDB Entry DOI: 10.7270/Q2TM7CRB