BDBM50053264 CHEMBL3322940
SMILES: Oc1ccc(cc1C(=O)Nc1cccc(c1)C(F)(F)F)-n1cc(nn1)-c1ccc(cc1)C#N
InChI Key: InChIKey=RLPINRPHYGIMFY-UHFFFAOYSA-N
Data: 1 IC50
Activity Spreadsheet -- Enzyme Inhibition Constant Data from BindingDB
Found 1 hit for monomerid = 50053264
Trg + Lig
Ki
nM
ΔG°
kcal/mole
IC50
nM
Kd
nM
EC50/IC50
nM
koff
s-1
kon
M-1s-1
pHTemp
°C
Aurora kinase A
(Homo sapiens (Human))
BDBM50053264
(CHEMBL3322940)
Show SMILES Oc1ccc(cc1C(=O)Nc1cccc(c1)C(F)(F)F)-n1cc(nn1)-c1ccc(cc1)C#N
Show InChI InChI=1S/C23H14F3N5O2/c24-23(25,26)16-2-1-3-17(10-16)28-22(33)19-11-18(8-9-21(19)32)31-13-20(29-30-31)15-6-4-14(12-27)5-7-15/h1-11,13,32H,(H,28,33)
NCI pathway
Reactome pathway
n/an/a 1.44E+3n/an/an/an/an/an/a
Ewha Womans University
Curated by ChEMBL
Assay Description
Inhibition of Aurora A (unknown origin) using [33P]-ATP and 10 uM ATP after 2 hrs
Bioorg Med Chem 22: 4855-66 (2014)
Article DOI: 10.1016/j.bmc.2014.06.047
BindingDB Entry DOI: 10.7270/Q2PV6N11