null
SMILES: N#Cc1ccc2c(\C=C\c3ccncc3)n[nH]c2c1
InChI Key: InChIKey=AOZVPLHGFARPCF-DUXPYHPUSA-N
Activity Spreadsheet -- Enzyme Inhibition Constant Data from BindingDB
Found 1 hit for monomerid = 50053307
Trg + Lig
Ki
nM
ΔG°
kcal/mole
IC50
nM
Kd
nM
EC50/IC50
nM
koff
s-1
kon
M-1s-1
pHTemp
°C
Dual specificity protein kinase TTK
(Homo sapiens (Human))
BDBM50053307
(CHEMBL3330412)
Show SMILES N#Cc1ccc2c(\C=C\c3ccncc3)n[nH]c2c1
Show InChI InChI=1S/C15H10N4/c16-10-12-1-3-13-14(18-19-15(13)9-12)4-2-11-5-7-17-8-6-11/h1-9H,(H,18,19)/b4-2+
n/an/a 5.00E+3n/an/an/an/an/an/a
University Health Network
Curated by ChEMBL
Assay Description
Inhibition of GST-fused full length human TTK compound pre-incubated for 15 mins prior ATP addition by MBP-based assay
Bioorg Med Chem 22: 4968-97 (2014)
Article DOI: 10.1016/j.bmc.2014.06.027
BindingDB Entry DOI: 10.7270/Q2K35WB2