null
SMILES: NS(=O)(=O)c1cccc(c1)-c1n[nH]c2cc(ccc12)-c1ccccc1
InChI Key: InChIKey=RVAJALXTQIKGPH-UHFFFAOYSA-N
Activity Spreadsheet -- Enzyme Inhibition Constant Data from BindingDB
Found 1 hit for monomerid = 50053318
Trg + Lig
Ki
nM
ΔG°
kcal/mole
IC50
nM
Kd
nM
EC50/IC50
nM
koff
s-1
kon
M-1s-1
pHTemp
°C
Dual specificity protein kinase TTK
(Homo sapiens (Human))
BDBM50053318
(CHEMBL3330245)
Show SMILES NS(=O)(=O)c1cccc(c1)-c1n[nH]c2cc(ccc12)-c1ccccc1
Show InChI InChI=1S/C19H15N3O2S/c20-25(23,24)16-8-4-7-15(11-16)19-17-10-9-14(12-18(17)21-22-19)13-5-2-1-3-6-13/h1-12H,(H,21,22)(H2,20,23,24)
n/an/a 5.40E+3n/an/an/an/an/an/a
University Health Network
Curated by ChEMBL
Assay Description
Inhibition of SUMO-tagged human TTK (1-275 residues) compound pre-incubated for 15 mins prior ATP addition by MBP-based assay
Bioorg Med Chem 22: 4968-97 (2014)
Article DOI: 10.1016/j.bmc.2014.06.027
BindingDB Entry DOI: 10.7270/Q2K35WB2