null
SMILES: Cc1ccccc1CNC(=O)c1ccc2[nH]nc(-c3cccc(c3)S(N)(=O)=O)c2c1
InChI Key: InChIKey=KFKYGPUSIBSXDP-UHFFFAOYSA-N
Activity Spreadsheet -- Enzyme Inhibition Constant Data from BindingDB
Found 1 hit for monomerid = 50053344
Trg + Lig
Ki
nM
ΔG°
kcal/mole
IC50
nM
Kd
nM
EC50/IC50
nM
koff
s-1
kon
M-1s-1
pHTemp
°C
Dual specificity protein kinase TTK
(Homo sapiens (Human))
BDBM50053344
(CHEMBL3330272)
Show SMILES Cc1ccccc1CNC(=O)c1ccc2[nH]nc(-c3cccc(c3)S(N)(=O)=O)c2c1
Show InChI InChI=1S/C22H20N4O3S/c1-14-5-2-3-6-17(14)13-24-22(27)16-9-10-20-19(12-16)21(26-25-20)15-7-4-8-18(11-15)30(23,28)29/h2-12H,13H2,1H3,(H,24,27)(H,25,26)(H2,23,28,29)
n/an/a 18n/an/an/an/an/an/a
University Health Network
Curated by ChEMBL
Assay Description
Inhibition of SUMO-tagged human TTK (1-275 residues) compound pre-incubated for 15 mins prior ATP addition by MBP-based assay
Bioorg Med Chem 22: 4968-97 (2014)
Article DOI: 10.1016/j.bmc.2014.06.027
BindingDB Entry DOI: 10.7270/Q2K35WB2