BDBM50053789 CHEMBL3356454
SMILES: CC(N)CNc1ccc2OCC3=NNC(=O)CN3c2c1
InChI Key: InChIKey=VLWZLCKYWYQQEA-UHFFFAOYSA-N
Data: 1 IC50
Activity Spreadsheet -- Enzyme Inhibition Constant Data from BindingDB
Found 1 hit for monomerid = 50053789
Trg + Lig
Ki
nM
ΔG°
kcal/mole
IC50
nM
Kd
nM
EC50/IC50
nM
koff
s-1
kon
M-1s-1
pHTemp
°C
Protein kinase C theta type
(Homo sapiens (Human))
BDBM50053789
(CHEMBL3356454)
Show SMILES CC(N)CNc1ccc2OCC3=NNC(=O)CN3c2c1 |t:11|
Show InChI InChI=1S/C13H17N5O2/c1-8(14)5-15-9-2-3-11-10(4-9)18-6-13(19)17-16-12(18)7-20-11/h2-4,8,15H,5-7,14H2,1H3,(H,17,19)
NCI pathway
Reactome pathway
n/an/a 1.80E+4n/an/an/an/an/an/a
AbbVie Bioresearch Center
Curated by ChEMBL
Assay Description
Inhibition of human recombinant PKCtheta expressed in Sf21 cells using Bio-cdc peptide substrate and ATP after 60 mins by time-resolved fluorescence ...
J Med Chem 58: 222-36 (2015)
Article DOI: 10.1021/jm500669m
BindingDB Entry DOI: 10.7270/Q22F7Q2Z