BDBM50055470 (1H-Indol-2-yl)-{4-[(3-isopropoxy-pyridin-2-yl)-methyl-amino]-piperidin-1-yl}-methanone::CHEMBL358754
SMILES: CC(C)Oc1cccnc1N(C)C1CCN(CC1)C(=O)c1cc2ccccc2[nH]1
InChI Key: InChIKey=JMCOWKMLYTUQLQ-UHFFFAOYSA-N
Data: 1 IC50
Activity Spreadsheet -- Enzyme Inhibition Constant Data from BindingDB
Found 1 hit for monomerid = 50055470
Trg + Lig
Ki
nM
ΔG°
kcal/mole
IC50
nM
Kd
nM
EC50/IC50
nM
koff
s-1
kon
M-1s-1
pHTemp
°C
Human immunodeficiency virus type 1 reverse transcriptase
(Human immunodeficiency virus 1)
BDBM50055470
((1H-Indol-2-yl)-{4-[(3-isopropoxy-pyridin-2-yl)-me...)
Show SMILES CC(C)Oc1cccnc1N(C)C1CCN(CC1)C(=O)c1cc2ccccc2[nH]1
Show InChI InChI=1S/C23H28N4O2/c1-16(2)29-21-9-6-12-24-22(21)26(3)18-10-13-27(14-11-18)23(28)20-15-17-7-4-5-8-19(17)25-20/h4-9,12,15-16,18,25H,10-11,13-14H2,1-3H3
n/an/a 2.00E+3n/an/an/an/an/an/a
Pharmacia & Upjohn
Curated by ChEMBL
Assay Description
In vitro for inhibition of HIV-1 reverse transcriptase.
J Med Chem 39: 5267-75 (1997)
Article DOI: 10.1021/jm960269m
BindingDB Entry DOI: 10.7270/Q2XK8DPT