BDBM50055473 CHEMBL151955::N-(2-{4-[(3-Isopropoxy-pyridin-2-yl)-methyl-amino]-piperidine-1-carbonyl}-1H-indol-5-yl)-methanesulfonamide
SMILES: CC(C)Oc1cccnc1N(C)C1CCN(CC1)C(=O)c1cc2cc(NS(C)(=O)=O)ccc2[nH]1
InChI Key: InChIKey=GOVNLCZMXFXJSM-UHFFFAOYSA-N
Data: 1 IC50
Activity Spreadsheet -- Enzyme Inhibition Constant Data from BindingDB
Found 1 hit for monomerid = 50055473
Trg + Lig
Ki
nM
ΔG°
kcal/mole
IC50
nM
Kd
nM
EC50/IC50
nM
koff
s-1
kon
M-1s-1
pHTemp
°C
Human immunodeficiency virus type 1 reverse transcriptase
(Human immunodeficiency virus 1)
BDBM50055473
(CHEMBL151955 | N-(2-{4-[(3-Isopropoxy-pyridin-2-yl...)
Show SMILES CC(C)Oc1cccnc1N(C)C1CCN(CC1)C(=O)c1cc2cc(NS(C)(=O)=O)ccc2[nH]1
Show InChI InChI=1S/C24H31N5O4S/c1-16(2)33-22-6-5-11-25-23(22)28(3)19-9-12-29(13-10-19)24(30)21-15-17-14-18(27-34(4,31)32)7-8-20(17)26-21/h5-8,11,14-16,19,26-27H,9-10,12-13H2,1-4H3
n/an/a 1.40E+3n/an/an/an/an/an/a
Pharmacia & Upjohn
Curated by ChEMBL
Assay Description
In vitro for inhibition of HIV-1 reverse transcriptase.
J Med Chem 39: 5267-75 (1997)
Article DOI: 10.1021/jm960269m
BindingDB Entry DOI: 10.7270/Q2XK8DPT