BDBM50055516 CHEMBL3317817
SMILES: CC(C)(C)OC(=O)NCCC[C@@H]1NC(=O)[C@]2(C)CSC(=N2)c2csc(CNC(=O)C[C@H](OC1=O)\C=C\CCS)n2
InChI Key: InChIKey=GTUXNVSIYBGMNH-AFVUVFFESA-N
Data: 4 IC50
Activity Spreadsheet -- Enzyme Inhibition Constant Data from BindingDB
Found 4 hits for monomerid = 50055516
Trg + Lig
Ki
nM
ΔG°
kcal/mole
IC50
nM
Kd
nM
EC50/IC50
nM
koff
s-1
kon
M-1s-1
pHTemp
°C
Histone deacetylase 1
(Homo sapiens (Human))
BDBM50055516
(CHEMBL3317817)
Show SMILES CC(C)(C)OC(=O)NCCC[C@@H]1NC(=O)[C@]2(C)CSC(=N2)c2csc(CNC(=O)C[C@H](OC1=O)\C=C\CCS)n2 |r,c:19|
Show InChI InChI=1S/C26H37N5O6S3/c1-25(2,3)37-24(35)27-10-7-9-17-22(33)36-16(8-5-6-11-38)12-19(32)28-13-20-29-18(14-39-20)21-31-26(4,15-40-21)23(34)30-17/h5,8,14,16-17,38H,6-7,9-13,15H2,1-4H3,(H,27,35)(H,28,32)(H,30,34)/b8-5+/t16-,17+,26+/m1/s1
NCI pathway
Reactome pathway
n/an/a 0.960n/an/an/an/an/an/a
Duke University
Curated by ChEMBL
Assay Description
Inhibition of HDAC1 (unknown origin) incubated at 37 degC for 30 mins
Bioorg Med Chem Lett 24: 3728-31 (2014)
Article DOI: 10.1016/j.bmcl.2014.07.006
BindingDB Entry DOI: 10.7270/Q25Q4XRZ
Histone deacetylase 8
(Homo sapiens (Human))
BDBM50055516
(CHEMBL3317817)
Show SMILES CC(C)(C)OC(=O)NCCC[C@@H]1NC(=O)[C@]2(C)CSC(=N2)c2csc(CNC(=O)C[C@H](OC1=O)\C=C\CCS)n2 |r,c:19|
Show InChI InChI=1S/C26H37N5O6S3/c1-25(2,3)37-24(35)27-10-7-9-17-22(33)36-16(8-5-6-11-38)12-19(32)28-13-20-29-18(14-39-20)21-31-26(4,15-40-21)23(34)30-17/h5,8,14,16-17,38H,6-7,9-13,15H2,1-4H3,(H,27,35)(H,28,32)(H,30,34)/b8-5+/t16-,17+,26+/m1/s1
NCI pathway
Reactome pathway
n/an/a 790n/an/an/an/an/an/a
Duke University
Curated by ChEMBL
Assay Description
Inhibition of HDAC8 (unknown origin) incubated at 37 degC for 30 mins
Bioorg Med Chem Lett 24: 3728-31 (2014)
Article DOI: 10.1016/j.bmcl.2014.07.006
BindingDB Entry DOI: 10.7270/Q25Q4XRZ
Histone deacetylase 3
(Homo sapiens (Human))
BDBM50055516
(CHEMBL3317817)
Show SMILES CC(C)(C)OC(=O)NCCC[C@@H]1NC(=O)[C@]2(C)CSC(=N2)c2csc(CNC(=O)C[C@H](OC1=O)\C=C\CCS)n2 |r,c:19|
Show InChI InChI=1S/C26H37N5O6S3/c1-25(2,3)37-24(35)27-10-7-9-17-22(33)36-16(8-5-6-11-38)12-19(32)28-13-20-29-18(14-39-20)21-31-26(4,15-40-21)23(34)30-17/h5,8,14,16-17,38H,6-7,9-13,15H2,1-4H3,(H,27,35)(H,28,32)(H,30,34)/b8-5+/t16-,17+,26+/m1/s1
NCI pathway
Reactome pathway
n/an/a 1.80n/an/an/an/an/an/a
Duke University
Curated by ChEMBL
Assay Description
Inhibition of HDAC3 (unknown origin) incubated at 37 degC for 30 mins
Bioorg Med Chem Lett 24: 3728-31 (2014)
Article DOI: 10.1016/j.bmcl.2014.07.006
BindingDB Entry DOI: 10.7270/Q25Q4XRZ
Histone deacetylase 2
(Homo sapiens (Human))
BDBM50055516
(CHEMBL3317817)
Show SMILES CC(C)(C)OC(=O)NCCC[C@@H]1NC(=O)[C@]2(C)CSC(=N2)c2csc(CNC(=O)C[C@H](OC1=O)\C=C\CCS)n2 |r,c:19|
Show InChI InChI=1S/C26H37N5O6S3/c1-25(2,3)37-24(35)27-10-7-9-17-22(33)36-16(8-5-6-11-38)12-19(32)28-13-20-29-18(14-39-20)21-31-26(4,15-40-21)23(34)30-17/h5,8,14,16-17,38H,6-7,9-13,15H2,1-4H3,(H,27,35)(H,28,32)(H,30,34)/b8-5+/t16-,17+,26+/m1/s1
NCI pathway
Reactome pathway
n/an/a 1.40n/an/an/an/an/an/a
Duke University
Curated by ChEMBL
Assay Description
Inhibition of HDAC2 (unknown origin) incubated at 37 degC for 30 mins
Bioorg Med Chem Lett 24: 3728-31 (2014)
Article DOI: 10.1016/j.bmcl.2014.07.006
BindingDB Entry DOI: 10.7270/Q25Q4XRZ