BDBM50055544 CHEMBL3342004
SMILES: NC(CO)(CCc1ccc(cc1)-c1cn(nn1)-c1ccc(F)cc1)COP(O)(O)=O
InChI Key: InChIKey=PAQCIOUCGIZYSB-UHFFFAOYSA-N
Data: 2 EC50
Activity Spreadsheet -- Enzyme Inhibition Constant Data from BindingDB
Found 2 hits for monomerid = 50055544
Trg + Lig
Ki
nM
ΔG°
kcal/mole
IC50
nM
Kd
nM
EC50/IC50
nM
koff
s-1
kon
M-1s-1
pHTemp
°C
Sphingosine 1-phosphate receptor 3
(Homo sapiens (Human))
BDBM50055544
(CHEMBL3342004)
Show SMILES NC(CO)(CCc1ccc(cc1)-c1cn(nn1)-c1ccc(F)cc1)COP(O)(O)=O
Show InChI InChI=1S/C19H22FN4O5P/c20-16-5-7-17(8-6-16)24-11-18(22-23-24)15-3-1-14(2-4-15)9-10-19(21,12-25)13-29-30(26,27)28/h1-8,11,25H,9-10,12-13,21H2,(H2,26,27,28)
NCI pathway
Reactome pathway
n/an/an/an/a>5.00E+3n/an/an/an/a
Peking Union Medical College and Chinese Academy of Medical Sciences
Curated by ChEMBL
Assay Description
Agonist activity at human S1P3 receptor expressed in CHO cells preincubated for 2 hrs before IP1 addition by IP1-HTRF assay
Eur J Med Chem 85: 1-15 (2014)
Article DOI: 10.1016/j.ejmech.2014.07.081
BindingDB Entry DOI: 10.7270/Q2X92D0T
Sphingosine 1-phosphate receptor 1
(Homo sapiens (Human))
BDBM50055544
(CHEMBL3342004)
Show SMILES NC(CO)(CCc1ccc(cc1)-c1cn(nn1)-c1ccc(F)cc1)COP(O)(O)=O
Show InChI InChI=1S/C19H22FN4O5P/c20-16-5-7-17(8-6-16)24-11-18(22-23-24)15-3-1-14(2-4-15)9-10-19(21,12-25)13-29-30(26,27)28/h1-8,11,25H,9-10,12-13,21H2,(H2,26,27,28)
Reactome pathway
n/an/an/an/a 1.63E+3n/an/an/an/a
Peking Union Medical College and Chinese Academy of Medical Sciences
Curated by ChEMBL
Assay Description
Agonist activity at human S1P1 receptor expressed in CHO cells preincubated for 2 hrs before IP1 addition by IP1-HTRF assay
Eur J Med Chem 85: 1-15 (2014)
Article DOI: 10.1016/j.ejmech.2014.07.081
BindingDB Entry DOI: 10.7270/Q2X92D0T